program: Orca
programVersion: 5.0.4
elementType: F Si F C C C C C C C C C C C C H H H H H H H H
charge: 0
multiplicity: 1
keywords: Freq RIJCOSX PBEh-3c
frequency: 0.00 0.00 0.00 0.00 0.00 0.00 76.45 77.08 104.34 149.70 198.64 206.40 274.63 285.52 302.77 406.19 438.28 449.17 455.89 483.19 514.50 523.60 582.74 646.97 712.25 746.04 766.78 771.99 788.50 794.05 836.23 926.46 929.53 929.73 973.54 1009.21 1009.83 1050.56 1052.58 1054.57 1093.06 1100.57 1118.58 1137.25 1197.85 1198.23 1218.41 1228.56 1304.58 1344.07 1356.51 1371.78 1401.06 1520.00 1526.73 1558.55 1560.27 1680.06 1693.47 1714.24 1724.07 3261.72 3262.94 3266.09 3268.99 3277.54 3280.28 3290.19 3290.88
frequency: 76.45 77.08 104.34 149.70 198.64 206.40 274.63 285.52 302.77 406.19 438.28 449.17 455.89 483.19 514.50 523.60 582.74 646.97 712.25 746.04 766.78 771.99 788.50 794.05 836.23 926.46 929.53 929.73 973.54 1009.21 1009.83 1050.56 1052.58 1054.57 1093.06 1100.57 1118.58 1137.25 1197.85 1198.23 1218.41 1228.56 1304.58 1344.07 1356.51 1371.78 1401.06 1520.00 1526.73 1558.55 1560.27 1680.06 1693.47 1714.24 1724.07 3261.72 3262.94 3266.09 3268.99 3277.54 3280.28 3290.19 3290.88
formula: C12H8F2Si
InChI: InChI=1/C12H8F2Si/c13-15(14)11-7-3-1-5-9(11)10-6-2-4-8-12(10)15/h1-8H
23 atoms
F  0.533073 3.371969 -0.519404
Si 0.259413 2.10936 0.43385
F  0.204883 2.738586 1.911359
C  -1.220835 1.078155 0.035066
C  -0.777932 -0.248141 -0.105775
C  -1.70239 -1.258171 -0.33573
C  -3.051137 -0.94826 -0.438581
C  -3.488328 0.362742 -0.317778
C  -2.569978 1.375778 -0.074963
C  0.689364 -0.451006 0.001631
C  1.446938 0.705319 0.254235
C  2.828094 0.627178 0.337759
C  3.466738 -0.596132 0.181224
C  2.715994 -1.73928 -0.051273
C  1.33314 -1.672691 -0.143326
H  -1.387325 -2.288839 -0.435413
H  -3.767242 -1.739944 -0.616373
H  -4.541494 0.592681 -0.407447
H  -2.91627 2.396775 0.02523
H  3.417148 1.516864 0.521416
H  4.544889 -0.659805 0.241974
H  3.211591 -2.694542 -0.16576
H  0.771766 -2.578597 -0.331919
totalener: -949.69234106 hartree
nucrepener: 1042.20733986 hartree
electener: -1991.89968092 hartree
oneelecener: -3374.24895791 hartree
twoeener: 1382.34927698 hartree
kineticenergy: 944.15062298 hartree
exchangeener: -59.065733233052 hartree
correlationener: -5.057399970127 hartree
xcener: -64.123133203178 hartree
energy: -1818.4747 -682.7210 -682.6285 -285.0831 -285.0758 -284.7816 -284.7809 -284.7511 -284.7505 -284.6775 -284.6758 -284.6019 -284.6013 -284.3797 -284.3792 -152.0017 -105.5913 -105.5320 -105.4884 -35.7697 -35.2159 -26.9503 -26.1615 -24.2473 -23.3786 -23.0102 -22.3449 -19.8114 -19.4618 -18.3123 -18.0371 -17.3105 -16.3479 -15.5508 -15.1129 -15.0652 -14.7346 -14.3149 -14.1665 -13.8432 -13.6699 -13.5467 -13.4198 -13.0699 -12.9572 -12.5963 -12.5154 -11.6010 -11.4971 -11.0855 -11.0653 -9.6249 -9.3774 -8.6196 -8.3243 -7.4078 -1.1821 -0.5726 0.3783 1.3627 2.2944 3.3589 3.5423 3.7705 4.3265 4.6438 5.0408 5.5010 5.5512 5.8969 5.9115 6.2792 6.6748 6.7662 7.0882 7.5151 7.6969 8.1586 8.4546 8.6387 9.7002 9.9461 10.8719 10.9373 11.9425 12.0583 12.3654 13.3127 13.8866 13.9993 14.6805 14.8926 15.0663 15.1845 15.5475 15.5882 16.0193 16.2479 16.2563 16.6128 16.7113 16.7418 16.9296 17.2761 17.2837 17.4019 18.2911 18.4733 18.5882 18.9424 19.2369 19.6207 19.9655 20.1630 20.9307 21.7611 22.2596 22.9408 23.0941 23.3530 23.4346 23.7649 24.6966 25.2323 25.4946 25.6942 26.2880 26.8038 26.9173 27.2118 27.4940 27.9530 28.2069 28.3971 28.8092 29.0888 29.2820 29.6512 30.4939 30.9158 31.5867 31.9791 32.8490 33.1772 33.5722 33.8744 34.2396 34.3485 34.4143 34.9780 35.1906 35.3969 35.4481 35.5802 35.9004 36.5746 36.9141 37.6743 37.8788 38.0058 38.5015 38.6025 40.2527 40.3533 40.6850 40.8460 41.2178 41.7182 41.8757 41.9762 42.1889 42.2270 43.3417 44.0263 46.8647 47.0699 47.7400 47.8726 48.3600 49.2082 49.7819 51.2632 51.2873 51.4574 52.0336 53.7548 54.5500 54.5620 55.9023 56.5318 57.7257 58.3681 58.4946 59.0269 59.5563 59.8307 60.2913 60.5261 61.2766 61.7282 61.9290 62.8659 63.5521 63.9795 64.2720 64.8774 65.3956 68.5570 69.4255 70.4419 71.0233 72.2671 73.2826 73.7180 73.9221 75.0037 75.1168 75.7376 76.1583 76.4045 77.0876 77.7696 78.8649 79.4185 81.5541 81.6299 83.7414 89.8179 92.1545 96.0634 359.7480 363.9904 370.8382 372.8792 373.4808 377.6003 383.5162 385.1405 385.1557 386.8270 395.5810 395.9081 892.5389 892.6324 electronvolt
chargesum: 0.0000000
charge: -0.450215 1.367241 -0.449174 -0.260222 0.122098 -0.302239 -0.208956 -0.216628 -0.267720 0.124050 -0.260762 -0.267809 -0.217000 -0.208233 -0.302589 0.211241 0.229231 0.226644 0.232045 0.231994 0.226607 0.229183 0.211212
charge: -0.232710 0.721024 -0.234494 -0.186988 -0.020558 -0.126408 -0.112205 -0.134503 -0.104622 -0.020420 -0.187135 -0.104599 -0.134573 -0.112043 -0.126505 0.137138 0.140020 0.139722 0.141516 0.141530 0.139722 0.139987 0.137103
qa: -0.4502 1.3672 -0.4492 -0.2602 0.1221 -0.3022 -0.2090 -0.2166 -0.2677 0.1241 -0.2608 -0.2678 -0.2170 -0.2082 -0.3026 0.2112 0.2292 0.2266 0.2320 0.2320 0.2266 0.2292 0.2112
va: 0.9872 3.7477 0.9861 3.6592 3.7216 3.7606 3.8230 3.8124 3.8128 3.7205 3.6589 3.8127 3.8121 3.8227 3.7605 0.9212 0.9075 0.9089 0.9072 0.9072 0.9089 0.9076 0.9213
dispersion: -0.016768720 hartree
energy: -949.678361082897 hartree
dipole: -1.75143 1.62453 -0.12691 -14.40227 13.32822 -1.07405 -3.16807 2.89933 -0.26874
magnitude: 1.11441 au
magnitude: 2.83261 debye
temp: 298.15 k
press: 1.00 atm
zeropoint: 0.17262687 hartree
thermalvibcorrection: 0.00860247 hartree
thermalrotcorrection: 0.00141627 hartree
thermaltrasncorrection: 0.00141627 hartree
thermaltotal: -949.49429920 hartree
thermalcorr: 0.01143502 hartree
nonthermalcorr: 0.17262687 hartree
totalcorr: 0.18406189 hartree
thermalcorrenthalpy: 0.00094421 hartree
totalenthalpy: -949.49335499 hartree
vibrat: 0.01442316 hartree
rotat: 0.01525703 hartree
transl: 0.01997678 hartree
total: 0.04965697 hartree
totalentropycorr: -0.04965697 hartree
gibbsenthalpy: -949.54301196 hartree
gibbsminuselec: 0.13534913 hartree
