program: Orca
programVersion: 5.0.4
elementType: O Si C C C C C C C C C C C C H H H H H H H H
charge: 0
multiplicity: 1
keywords: Opt RIJCOSX PBEh-3c
formula: C12H8OSi
InChI: InChI=1/C12H8OSi/c13-14-11-7-3-1-5-9(11)10-6-2-4-8-12(10)14/h1-8H
22 atoms
O  -0.363006 3.635297 1.288891
Si -0.217417 2.17928 0.876486
C  1.240409 1.06682 0.645484
C  0.762691 -0.187034 0.228837
C  1.664208 -1.210734 -0.020673
C  3.024816 -0.984015 0.145611
C  3.496766 0.253511 0.559294
C  2.599375 1.283782 0.810504
C  -0.713274 -0.294648 0.094888
C  -1.432929 0.871395 0.403856
C  -2.816301 0.889593 0.321005
C  -3.497594 -0.255096 -0.072443
C  -2.786555 -1.405917 -0.381166
C  -1.39963 -1.432989 -0.300191
H  1.32558 -2.186712 -0.343594
H  3.724152 -1.786173 -0.050925
H  4.559194 0.412907 0.685225
H  2.959739 2.251696 1.134726
H  -3.363208 1.791909 0.562967
H  -4.57711 -0.251133 -0.139401
H  -3.31724 -2.296794 -0.690784
H  -0.872665 -2.345046 -0.548797
totalener: -825.30934531 hartree
nucrepener: 876.39693639 hartree
electener: -1701.70628169 hartree
oneelecener: -2867.60327704 hartree
twoeener: 1165.89699535 hartree
kineticenergy: 820.60823731 hartree
exchangeener: -52.350997764441 hartree
correlationener: -4.564272364347 hartree
xcener: -56.915270128788 hartree
dispersion: -0.016379040 hartree
energy: -1816.8870 -528.9893 -285.2987 -285.2915 -284.9714 -284.9707 -284.9678 -284.9664 -284.8815 -284.8799 -284.7738 -284.7725 -284.5974 -284.5924 -150.7648 -104.4055 -104.2204 -104.1855 -27.4389 -27.0938 -26.3527 -24.4320 -23.5425 -23.1885 -22.5343 -19.9628 -19.5822 -18.4797 -18.2035 -17.0300 -15.6653 -15.3441 -15.0096 -14.0206 -13.9836 -13.9373 -13.6619 -12.9423 -12.8845 -12.0299 -11.7972 -11.7072 -11.2478 -10.4700 -10.4212 -9.8167 -9.4568 -8.6521 -8.6343 -8.5172 -7.6194 -1.9659 -0.7974 0.1608 1.0678 1.1800 1.7827 3.5512 3.5946 4.1503 4.7065 4.8231 4.8615 5.3173 5.4363 5.6583 6.0805 6.6276 6.8535 6.9308 7.3502 7.7616 7.9411 8.3183 8.5332 9.7012 10.1454 10.8164 11.0270 11.8971 12.0918 12.2899 13.6139 13.6548 14.0788 14.3196 14.8267 14.8646 14.8726 15.4462 15.4997 15.8356 15.8796 16.0447 16.4521 16.5751 16.6223 16.7075 17.0893 17.1014 17.8763 18.0413 18.3668 18.8222 18.9281 19.0462 19.0813 19.4421 20.1745 20.4737 21.0135 21.4224 21.4697 22.9806 23.0507 23.7257 24.2086 25.0279 25.5521 25.7820 26.0789 26.5106 26.7684 26.7977 27.1823 27.5968 27.8476 28.0496 28.3499 28.8641 29.1755 29.3368 29.5786 30.4046 30.6991 31.4127 31.4176 31.4276 32.6718 34.3943 34.5907 35.0661 35.2559 35.4317 36.2054 36.4639 36.6555 36.6632 37.8566 39.9509 40.1862 40.2708 41.0430 41.5066 41.7206 41.7789 41.8478 42.2813 42.9948 43.5635 44.0380 48.1948 48.8258 49.2230 49.8275 51.0521 51.7190 52.6108 52.8703 53.4148 54.3317 54.3909 54.7339 55.3008 56.2696 57.3943 57.4967 58.0476 58.0952 58.7559 59.0173 59.6523 59.8511 59.9302 60.4756 61.1207 61.5311 62.3619 62.6751 63.3635 63.9992 64.8320 65.0729 65.9843 68.0576 68.8869 70.2001 71.3909 71.9533 73.2459 73.3601 73.6545 74.4168 74.8698 74.8877 75.9409 76.2574 76.3412 77.7969 78.6049 78.7120 81.4104 82.7063 89.6121 92.0062 95.9599 359.3596 363.7885 370.6120 372.5423 373.3095 377.3453 383.3005 384.6304 384.9204 386.5962 395.1729 395.5823 695.8466 electronvolt
chargesum: -0.0000000
charge: -0.569519 0.971581 -0.265965 0.123179 -0.302620 -0.206235 -0.217632 -0.259683 0.122735 -0.265155 -0.259332 -0.217357 -0.206549 -0.301659 0.214127 0.233208 0.230841 0.249414 0.249321 0.230650 0.233074 0.213575
charge: -0.414438 0.640045 -0.204522 -0.019713 -0.126208 -0.105707 -0.134301 -0.093389 -0.019673 -0.204558 -0.093225 -0.134296 -0.105636 -0.126098 0.138369 0.141713 0.141646 0.149196 0.149204 0.141643 0.141679 0.138269
qa: -0.5695 0.9716 -0.2660 0.1232 -0.3026 -0.2062 -0.2176 -0.2597 0.1227 -0.2652 -0.2593 -0.2174 -0.2065 -0.3017 0.2141 0.2332 0.2308 0.2494 0.2493 0.2306 0.2331 0.2136
va: 2.1797 3.9535 3.6403 3.7102 3.7567 3.8188 3.8031 3.8031 3.7098 3.6402 3.8031 3.8032 3.8187 3.7567 0.9203 0.9061 0.9076 0.9006 0.9006 0.9076 0.9062 0.9205
dispersion: -0.016379448 hartree
energy: -825.299471323192 hartree
dipole: 0.78972 -0.58957 0.20014 -7.93506 5.92055 -2.01451 -2.31463 1.74009 -0.57454
magnitude: 2.10438 au
magnitude: 5.34891 debye
