program: Orca
programVersion: 5.0.4
elementType: C C C C C C C C C C C C Si H H H H H H H H
charge: 2
multiplicity: 1
keywords: Freq RIJCOSX PBEh-3c
frequency: 0.00 0.00 0.00 0.00 0.00 0.00 13.34 88.83 145.72 159.05 220.21 316.50 344.10 372.10 373.94 399.27 441.25 443.80 488.90 598.24 653.18 655.72 664.79 712.44 770.15 816.13 818.80 903.98 928.59 990.83 1037.63 1043.41 1045.87 1056.62 1059.32 1072.72 1072.94 1073.81 1173.68 1188.78 1204.22 1236.21 1290.07 1327.23 1418.39 1435.60 1451.33 1481.25 1523.75 1537.89 1583.06 1592.17 1623.36 1668.48 1722.90 3273.67 3274.15 3283.31 3283.55 3291.25 3296.99 3303.67 3307.91
frequency: 13.34 88.83 145.72 159.05 220.21 316.50 344.10 372.10 373.94 399.27 441.25 443.80 488.90 598.24 653.18 655.72 664.79 712.44 770.15 816.13 818.80 903.98 928.59 990.83 1037.63 1043.41 1045.87 1056.62 1059.32 1072.72 1072.94 1073.81 1173.68 1188.78 1204.22 1236.21 1290.07 1327.23 1418.39 1435.60 1451.33 1481.25 1523.75 1537.89 1583.06 1592.17 1623.36 1668.48 1722.90 3273.67 3274.15 3283.31 3283.55 3291.25 3296.99 3303.67 3307.91
formula: C12H8Si
InChI: InChI=1/C12H8Si/c1-3-7-11-9(5-1)10-6-2-4-8-12(10)13-11/h1-8H
21 atoms
C  1.016033 -1.434978 -0.31997
C  2.330201 -1.794519 -0.421544
C  3.336466 -0.83125 -0.188581
C  3.039579 0.516378 0.14628
C  1.744092 0.919671 0.252159
C  0.697866 -0.042041 0.017687
C  -0.659476 0.222985 0.070045
C  -1.247134 1.504389 0.364951
C  -2.603093 1.620004 0.356036
C  -3.408217 0.487263 0.0636
C  -2.858063 -0.782051 -0.221113
C  -1.501428 -0.944249 -0.221509
Si -0.528796 -2.596882 -0.57586
H  2.621943 -2.807485 -0.670851
H  4.377536 -1.127664 -0.263268
H  3.851881 1.211023 0.314302
H  1.517973 1.946783 0.505571
H  -0.633639 2.366805 0.589176
H  -3.080337 2.567039 0.570529
H  -4.486696 0.606481 0.063749
H  -3.526792 -1.6078 -0.431486
totalener: -749.40846046 hartree
nucrepener: 752.34424978 hartree
electener: -1501.75271024 hartree
oneelecener: -2484.97566563 hartree
twoeener: 983.22295540 hartree
kineticenergy: 745.41150807 hartree
exchangeener: -47.327737561568 hartree
correlationener: -4.083343044897 hartree
xcener: -51.411080606465 hartree
energy: -1825.0425 -295.0890 -295.0716 -294.7289 -294.7271 -294.1807 -294.1788 -293.8597 -293.8576 -293.6390 -293.6372 -293.5020 -293.5016 -158.8636 -112.4072 -112.2820 -112.2162 -36.2133 -35.1717 -33.4672 -32.5317 -32.1461 -31.0620 -28.8960 -28.4804 -26.9540 -26.9135 -25.6259 -24.1485 -24.0922 -24.0494 -22.8918 -22.7041 -22.4504 -22.2832 -21.6069 -21.4401 -20.5781 -20.2209 -20.1200 -20.0686 -18.1946 -17.9551 -17.7066 -17.2611 -15.6726 -13.6780 -11.1964 -9.4673 -8.0042 -7.7040 -7.4858 -6.5999 -4.5381 -4.4333 -4.1980 -3.4325 -3.3748 -3.1006 -2.6718 -2.5353 -2.3843 -2.2421 -1.3279 -1.0735 -0.7657 -0.4700 -0.1362 0.0657 0.4149 0.4524 2.0094 2.4844 2.6029 2.7920 4.1565 4.4793 4.6364 4.7622 5.0057 5.4894 5.7200 5.7367 5.8715 6.1493 6.3715 6.7409 6.8728 7.3565 7.7297 7.7802 7.8067 7.8257 8.5870 8.8107 8.9514 9.0788 9.3528 9.3905 9.8545 10.2337 10.8896 10.9477 10.9683 11.0166 13.2064 13.4194 13.6228 13.9711 14.4231 14.6973 15.3452 16.6364 16.9324 17.5085 18.0412 18.1709 18.3480 18.7929 18.8348 19.0657 19.2143 19.7206 19.9795 20.2829 20.5397 20.8860 21.6348 22.4232 22.6374 23.1408 24.7025 24.8397 25.2698 26.2937 26.3191 26.4658 27.0756 27.5957 27.7844 27.9746 31.1704 31.2705 31.7702 31.8091 32.4856 32.5477 32.7155 32.7636 33.0725 33.8463 34.3552 34.5817 38.4474 39.0357 41.6533 41.8009 41.8438 42.4348 44.6169 44.8871 45.7723 45.8212 46.5756 46.8560 48.4931 48.6122 49.1910 49.3116 50.1770 50.4026 51.2397 51.5267 51.8662 51.8885 52.3156 53.2137 54.8551 54.9585 55.6914 56.0248 58.6090 59.8037 60.1961 61.7767 62.7684 63.1624 63.7152 63.9860 64.9012 65.6766 65.7588 66.2773 66.7258 67.7612 67.8116 69.3533 72.1821 73.1649 80.7714 81.5756 85.3731 349.7503 355.4125 360.8766 361.9534 363.4164 368.2201 370.7885 375.8499 376.1467 378.2042 384.1712 385.4252 electronvolt
chargesum: 2.0000000
charge: -0.195791 -0.240570 -0.101215 -0.183347 -0.208112 0.166770 0.166128 -0.207331 -0.183606 -0.101060 -0.240023 -0.195896 0.789257 0.338755 0.366310 0.352647 0.309963 0.309735 0.352649 0.366204 0.338532
charge: -0.098795 -0.083130 0.110638 -0.061381 -0.015180 0.074563 0.074706 -0.015307 -0.061262 0.110716 -0.083161 -0.098685 0.574984 0.193863 0.205170 0.200370 0.186247 0.186263 0.200362 0.205165 0.193852
qa: -0.1958 -0.2406 -0.1012 -0.1833 -0.2081 0.1668 0.1661 -0.2073 -0.1836 -0.1011 -0.2400 -0.1959 0.7893 0.3388 0.3663 0.3526 0.3100 0.3097 0.3526 0.3662 0.3385
va: 3.4996 3.6973 3.5606 3.6949 3.6381 3.5412 3.5416 3.6383 3.6949 3.5605 3.6973 3.4992 1.6734 0.8610 0.8394 0.8507 0.8823 0.8824 0.8507 0.8394 0.8611
dispersion: -0.015858860 hartree
energy: -749.399349370135 hartree
dipole: 1.27535 -1.03346 0.24188 6.26712 -5.07175 1.19537 1.35921 -1.10947 0.24974
magnitude: 1.24490 au
magnitude: 3.16428 debye
temp: 298.15 k
press: 1.00 atm
zeropoint: 0.16301444 hartree
thermalvibcorrection: 0.00741015 hartree
thermalrotcorrection: 0.00141627 hartree
thermaltrasncorrection: 0.00141627 hartree
thermaltotal: -749.22609224 hartree
thermalcorr: 0.01024270 hartree
nonthermalcorr: 0.16301444 hartree
totalcorr: 0.17325713 hartree
thermalcorrenthalpy: 0.00094421 hartree
totalenthalpy: -749.22514803 hartree
vibrat: 0.01282008 hartree
rotat: 0.01480706 hartree
transl: 0.01970592 hartree
total: 0.04733306 hartree
totalentropycorr: -0.04733306 hartree
gibbsenthalpy: -749.27248108 hartree
gibbsminuselec: 0.12686829 hartree
