program: Orca
programVersion: 5.0.4
elementType: C C C C C C C C C C C C Si H H H H H H H H
charge: 2
multiplicity: 1
keywords: SP DSD-BLYP D3BJ def2-QZVPP def2-QZVPP/C def2/J TightSCF
formula: C12H8Si
InChI: InChI=1/C12H8Si/c1-3-7-11-9(5-1)10-6-2-4-8-12(10)13-11/h1-8H
21 atoms
C  1.102366 -1.010847 -0.227253
C  2.416534 -1.370388 -0.328827
C  3.422798 -0.407119 -0.095864
C  3.125912 0.940509 0.238997
C  1.830425 1.343802 0.344876
C  0.784198 0.38209 0.110404
C  -0.573143 0.647116 0.162762
C  -1.160801 1.92852 0.457668
C  -2.51676 2.044135 0.448754
C  -3.321885 0.911394 0.156317
C  -2.771731 -0.35792 -0.128396
C  -1.415095 -0.520118 -0.128792
Si -0.442464 -2.172751 -0.483143
H  2.708276 -2.383354 -0.578134
H  4.463869 -0.703533 -0.17055
H  3.938214 1.635154 0.407019
H  1.604306 2.370914 0.598289
H  -0.547306 2.790936 0.681893
H  -2.994004 2.99117 0.663246
H  -4.400363 1.030612 0.156466
H  -3.440459 -1.183669 -0.338769
totalener: -749.23440406 hartree
nucrepener: 752.34424985 hartree
electener: -1501.57865391 hartree
oneelecener: -2485.64398309 hartree
twoeener: 984.06532918 hartree
kineticenergy: 747.76852107 hartree
exchangeener: -26.365347837147 hartree
correlationener: -1.727400454955 hartree
xcener: -28.092748292102 hartree
chargesum: 2.0000000
charge: -0.087543 -0.078765 0.088591 -0.065448 -0.036348 0.203920 0.204375 -0.031017 -0.065524 0.084569 -0.072322 -0.092862 0.591909 0.165761 0.189440 0.167810 0.157011 0.155561 0.169666 0.188624 0.162590
charge: -0.053526 0.121495 0.293814 0.172941 0.212425 0.005519 0.005685 0.212363 0.172991 0.293863 0.121524 -0.053309 0.627167 -0.022494 -0.003210 -0.018462 -0.022303 -0.022273 -0.018427 -0.003220 -0.022562
qa: -0.0875 -0.0788 0.0886 -0.0654 -0.0363 0.2039 0.2044 -0.0310 -0.0655 0.0846 -0.0723 -0.0929 0.5919 0.1658 0.1894 0.1678 0.1570 0.1556 0.1697 0.1886 0.1626
va: 3.4599 3.7790 3.6812 3.8314 3.7368 3.3917 3.3906 3.7360 3.8278 3.6820 3.7860 3.4576 1.9089 0.9667 0.9539 0.9696 0.9778 0.9777 0.9699 0.9542 0.9685
total: -750.231056479 hartree
dispersion: -0.022519274 hartree
energy: -750.253575753674 hartree
dipole: 1.27535 -1.04470 0.23065 6.26712 -5.12966 1.13746 1.35921 -1.11893 0.24028
magnitude: 1.18522 au
magnitude: 3.01258 debye
