program: Orca
programVersion: 5.0.4
elementType: F Si C C C C C C O C C C C C C H H H H H H H H
charge: 1
multiplicity: 1
keywords: Opt RIJCOSX PBEh-3c
formula: C12H8FOSi
InChI: InChI=1/C12H8FOSi/c13-15-11-7-3-1-5-9(11)14-10-6-2-4-8-12(10)15/h1-8H
23 atoms
F  0.093212 -2.816079 1.851119
Si 0.057871 -1.492021 1.001678
C  -1.429397 -0.783355 0.374676
C  -1.229358 0.402354 -0.364882
C  -2.318652 1.069339 -0.920315
C  -3.584964 0.562035 -0.735755
C  -3.805146 -0.611337 -0.002467
C  -2.740676 -1.276941 0.54491
O  -0.035723 0.978223 -0.595694
C  1.193155 0.600156 -0.199647
C  1.484165 -0.547269 0.571695
C  2.82505 -0.821678 0.917267
C  3.828719 0.016679 0.509992
C  3.518844 1.148664 -0.255086
C  2.222436 1.443821 -0.610693
H  -2.156788 1.976133 -1.487193
H  -4.427151 1.085261 -1.167941
H  -4.80942 -0.987474 0.129067
H  -2.902648 -2.184307 1.111371
H  3.058165 -1.697696 1.507709
H  4.854973 -0.192168 0.775608
H  4.313518 1.808549 -0.575887
H  1.989716 2.319008 -1.202133
totalener: -924.37381089 hartree
nucrepener: 1087.33596042 hartree
electener: -2011.70977131 hartree
oneelecener: -3408.34344661 hartree
twoeener: 1396.63367531 hartree
kineticenergy: 923.27851902 hartree
exchangeener: -58.201516886255 hartree
correlationener: -5.000590601647 hartree
xcener: -63.202107487902 hartree
dispersion: -0.016559869 hartree
dispersion: -0.016538425 hartree
dispersion: -0.016507061 hartree
dispersion: -0.016476623 hartree
dispersion: -0.016450609 hartree
dispersion: -0.016444429 hartree
dispersion: -0.016469641 hartree
dispersion: -0.016500268 hartree
dispersion: -0.016531487 hartree
dispersion: -0.016555675 hartree
dispersion: -0.016565458 hartree
dispersion: -0.016569912 hartree
dispersion: -0.016573728 hartree
dispersion: -0.016576681 hartree
dispersion: -0.016578264 hartree
energy: -1823.4042 -688.4292 -537.0598 -291.3007 -291.2882 -289.3559 -289.3300 -289.0540 -289.0451 -288.8337 -288.8303 -288.5830 -288.5786 -288.4546 -288.4480 -157.1627 -110.7757 -110.6669 -110.5670 -41.2426 -38.1146 -30.9781 -30.4481 -28.2607 -27.8266 -27.3354 -26.7961 -24.4749 -24.0580 -22.9651 -22.7121 -21.5011 -21.4669 -20.2370 -19.6016 -19.5083 -19.3876 -19.2343 -19.0759 -18.4520 -18.4416 -17.8997 -17.7297 -16.9337 -16.6829 -16.1980 -16.0802 -15.6153 -15.4437 -15.0239 -14.7462 -13.2754 -12.6889 -12.5727 -11.5599 -6.2940 -4.6522 -4.3044 -3.7627 -3.4931 -2.4498 -1.4578 -0.5327 -0.0698 0.6994 0.8313 1.3214 1.4103 1.4869 1.7483 2.2182 2.3520 2.7748 3.1386 3.2693 3.7223 4.0820 4.5824 4.6622 5.0582 5.5537 5.9563 6.3007 6.7829 7.3720 7.7859 7.9575 8.8053 9.0387 9.1812 9.9973 10.1803 10.2876 10.6849 11.0686 11.7610 11.7983 12.0772 12.1251 12.3238 12.7510 12.7753 12.8792 12.9129 13.0697 13.1410 13.2684 13.5118 13.6655 14.2151 14.6376 14.7410 14.8279 14.8834 15.6424 16.8345 17.0917 17.5176 18.0914 18.1892 18.3320 19.8577 19.9028 21.8742 21.9326 22.1780 22.4037 22.6151 22.7087 22.9990 23.2020 23.5242 23.7045 23.9051 24.3471 24.6899 24.9020 25.0939 25.9792 26.2432 26.2671 26.6048 27.1742 27.8842 28.8062 28.9040 29.1519 29.7539 29.8600 30.3266 30.4078 30.6632 31.7024 31.7184 31.9114 32.0880 32.3921 32.7538 33.5917 35.2733 35.6023 35.9915 36.6209 36.9297 37.3576 37.8798 37.9051 38.4518 38.7797 39.1328 40.1231 40.1963 40.3736 41.7014 42.6193 44.6998 44.9492 45.3657 46.9239 47.9889 48.6427 49.2424 49.2893 50.4599 50.5519 51.1562 51.4143 51.7432 52.5599 54.2190 54.3829 54.5151 55.1125 55.3839 55.4368 55.9896 56.5322 57.0796 57.5404 57.9236 58.4773 59.3438 59.5157 60.1401 60.3097 62.8205 63.7284 65.3951 67.1895 67.4072 67.4635 68.5039 69.7181 70.0620 70.2301 70.3337 71.0672 71.2494 71.4742 71.7373 71.7575 73.1678 75.1148 77.5012 77.7729 78.5993 82.0003 88.9336 90.3092 91.7384 356.8327 357.5449 367.7611 368.2663 369.7693 369.8693 380.1738 380.3583 381.7059 382.2863 391.4408 391.6348 696.9230 887.9543 electronvolt
chargesum: 1.0000000
charge: -0.394876 1.282699 -0.280211 0.390754 -0.299572 -0.204293 -0.200326 -0.256432 -0.451285 0.389931 -0.280412 -0.256134 -0.200999 -0.203173 -0.300099 0.290230 0.287199 0.279972 0.274647 0.274527 0.280328 0.287049 0.290474
charge: -0.165746 0.886814 -0.249353 0.119120 -0.130250 -0.053134 -0.114326 -0.079703 -0.048708 0.119583 -0.249593 -0.079907 -0.114278 -0.053162 -0.130131 0.173618 0.168128 0.165957 0.163578 0.163549 0.166008 0.168195 0.173742
qa: -0.3949 1.2827 -0.2802 0.3908 -0.2996 -0.2043 -0.2003 -0.2564 -0.4513 0.3899 -0.2804 -0.2561 -0.2010 -0.2032 -0.3001 0.2902 0.2872 0.2800 0.2746 0.2745 0.2803 0.2870 0.2905
va: 1.0886 3.4994 3.6811 3.7444 3.7559 3.7811 3.7841 3.7884 2.2529 3.7450 3.6823 3.7869 3.7839 3.7809 3.7563 0.8852 0.8850 0.8884 0.8912 0.8913 0.8882 0.8850 0.8851
dispersion: -0.016579165 hartree
energy: -924.733401399953 hartree
dipole: -0.23516 0.24639 0.01123 6.62242 -6.59210 0.03033 -4.17689 4.16812 -0.00877
magnitude: 0.03351 au
magnitude: 0.08517 debye
