program: Orca
programVersion: 5.0.4
elementType: F Si C C C C C C O C C C C C C H H H H H H H H
charge: 1
multiplicity: 1
keywords: SP DSD-BLYP D3BJ def2-QZVPP def2-QZVPP/C def2/J TightSCF
formula: C12H8FOSi
InChI: InChI=1/C12H8FOSi/c13-15-11-7-3-1-5-9(11)14-10-6-2-4-8-12(10)15/h1-8H
23 atoms
F  0.082462 -2.522652 1.615104
Si 0.047122 -1.198594 0.765663
C  -1.440146 -0.489928 0.138661
C  -1.240108 0.695781 -0.600897
C  -2.329402 1.362766 -1.156329
C  -3.595713 0.855462 -0.97177
C  -3.815896 -0.31791 -0.238482
C  -2.751426 -0.983515 0.308895
O  -0.046473 1.27165 -0.831708
C  1.182406 0.893583 -0.435661
C  1.473415 -0.253842 0.33568
C  2.8143 -0.528251 0.681253
C  3.81797 0.310106 0.273978
C  3.508095 1.44209 -0.491101
C  2.211687 1.737247 -0.846708
H  -2.167538 2.26956 -1.723208
H  -4.437901 1.378688 -1.403956
H  -4.820169 -0.694047 -0.106948
H  -2.913398 -1.89088 0.875357
H  3.047416 -1.404269 1.271694
H  4.844224 0.101259 0.539594
H  4.302768 2.101976 -0.811901
H  1.978967 2.612435 -1.438148
totalener: -924.57151136 hartree
nucrepener: 1019.91113052 hartree
electener: -1944.48264188 hartree
oneelecener: -3275.20643777 hartree
twoeener: 1330.72379589 hartree
kineticenergy: 922.70454658 hartree
exchangeener: -32.224039637537 hartree
correlationener: -2.104566984126 hartree
xcener: -34.328606621663 hartree
chargesum: 1.0000000
charge: -0.372877 0.974873 -0.059550 0.236709 -0.129362 -0.019891 -0.140338 -0.039008 -0.329610 0.241387 -0.068562 -0.038592 -0.140840 -0.014151 -0.130271 0.133170 0.135554 0.123772 0.123751 0.122801 0.124406 0.133149 0.133478
charge: 0.333003 0.195262 -0.112489 -0.285850 0.112475 0.137293 0.104076 0.103884 0.652341 -0.285024 -0.112089 0.103545 0.104002 0.137287 0.112254 -0.037448 -0.033364 -0.042803 -0.036407 -0.036645 -0.042751 -0.033306 -0.037245
qa: -0.3729 0.9749 -0.0595 0.2367 -0.1294 -0.0199 -0.1403 -0.0390 -0.3296 0.2414 -0.0686 -0.0386 -0.1408 -0.0142 -0.1303 0.1332 0.1356 0.1238 0.1238 0.1228 0.1244 0.1331 0.1335
va: 1.0681 3.8633 3.6268 3.6614 3.7956 3.7861 3.8665 3.7353 2.0904 3.6589 3.6235 3.7333 3.8668 3.7867 3.7976 0.9821 0.9725 0.9852 0.9749 0.9752 0.9849 0.9731 0.9823
total: -925.843062882 hartree
dispersion: -0.023380972 hartree
energy: -925.866443853483 hartree
dipole: -0.23516 0.24560 0.01043 6.62242 -6.53405 0.08837 -4.17689 4.12973 -0.04716
magnitude: 0.10071 au
magnitude: 0.25599 debye
