program: Orca
programVersion: 5.0.4
elementType: F Si F C C C C C C O C C C C C C H H H H H H H H
charge: 0
multiplicity: 1
keywords: Freq RIJCOSX PBEh-3c
frequency: 0.00 0.00 0.00 0.00 0.00 0.00 33.74 83.02 91.86 141.17 192.55 200.39 236.73 263.46 269.11 329.55 359.11 399.79 447.08 469.21 491.04 500.55 542.43 562.44 631.09 670.17 700.64 746.36 757.83 766.35 803.64 805.20 834.38 909.81 910.81 921.12 935.47 965.95 1007.02 1007.28 1042.71 1043.26 1096.59 1098.42 1137.26 1149.45 1202.63 1202.98 1222.41 1223.96 1276.36 1313.14 1347.74 1356.76 1394.86 1427.77 1526.44 1531.13 1555.86 1571.35 1675.60 1692.58 1719.94 1732.00 3260.38 3260.88 3273.73 3273.99 3287.32 3287.66 3295.60 3295.76
frequency: 33.74 83.02 91.86 141.17 192.55 200.39 236.73 263.46 269.11 329.55 359.11 399.79 447.08 469.21 491.04 500.55 542.43 562.44 631.09 670.17 700.64 746.36 757.83 766.35 803.64 805.20 834.38 909.81 910.81 921.12 935.47 965.95 1007.02 1007.28 1042.71 1043.26 1096.59 1098.42 1137.26 1149.45 1202.63 1202.98 1222.41 1223.96 1276.36 1313.14 1347.74 1356.76 1394.86 1427.77 1526.44 1531.13 1555.86 1571.35 1675.60 1692.58 1719.94 1732.00 3260.38 3260.88 3273.73 3273.99 3287.32 3287.66 3295.60 3295.76
formula: C12H8F2OSi
InChI: InChI=1/C12H8F2OSi/c13-16(14)11-7-3-1-5-9(11)15-10-6-2-4-8-12(10)16/h1-8H
24 atoms
F  0.167287 -3.029783 0.575856
Si 0.071946 -1.759144 -0.403344
F  0.046208 -2.408968 -1.875715
C  -1.409185 -0.738177 -0.086676
C  -1.247697 0.643606 0.009523
C  -2.347672 1.480156 0.200115
C  -3.608428 0.933953 0.313267
C  -3.79499 -0.444593 0.242889
C  -2.702347 -1.261132 0.042772
O  -0.064071 1.298805 -0.079171
C  1.179449 0.758589 -0.066292
C  1.467347 -0.601499 -0.182865
C  2.809996 -0.996971 -0.131272
C  3.828544 -0.079431 0.012588
C  3.514954 1.274642 0.103954
C  2.203343 1.696663 0.066995
H  -2.197156 2.549803 0.261541
H  -4.457318 1.587804 0.463301
H  -4.78484 -0.868342 0.340737
H  -2.846582 -2.333003 -0.014784
H  3.054276 -2.049694 -0.203803
H  4.858272 -0.406593 0.05243
H  4.304309 2.006754 0.211688
H  1.954555 2.746557 0.146468
totalener: -1024.76595259 hartree
nucrepener: 1178.58875190 hartree
electener: -2203.35470450 hartree
oneelecener: -3749.45883582 hartree
twoeener: 1546.10413133 hartree
kineticenergy: 1018.78840378 hartree
exchangeener: -63.695909444603 hartree
correlationener: -5.436156098523 hartree
xcener: -69.132065543127 hartree
energy: -1818.4458 -682.6696 -682.5695 -532.4328 -286.7351 -286.7299 -284.8757 -284.8730 -284.8318 -284.8289 -284.6297 -284.6285 -284.5348 -284.5330 -284.4813 -284.4725 -151.9822 -105.5708 -105.5147 -105.4746 -35.7223 -35.1607 -33.4453 -26.7418 -26.2729 -24.0060 -23.5086 -23.1737 -22.6131 -20.1420 -19.7679 -18.8296 -18.4210 -17.2269 -17.0365 -16.0131 -15.3015 -15.2974 -15.0893 -14.6327 -14.6074 -14.4780 -14.0005 -13.9189 -13.8252 -13.4016 -13.1535 -12.9525 -12.5987 -12.4761 -12.0703 -12.0457 -11.6590 -11.2595 -10.7297 -9.9468 -8.7346 -8.6037 -8.4434 -7.3887 -0.6826 -0.1971 0.2055 0.7962 2.2535 3.5554 3.5838 3.7255 4.1558 4.6903 4.8618 5.2403 5.3371 5.4719 6.0159 6.1418 6.4238 6.7212 6.8551 7.0065 7.7347 7.9723 8.3057 8.8997 8.9546 9.6247 9.6512 10.6051 11.5373 11.8497 11.9009 12.3403 12.7595 13.8492 13.9465 14.1704 14.4366 14.7749 14.9562 15.2710 15.2885 15.9794 16.1088 16.3099 16.4006 16.6021 16.6699 16.8694 16.8876 17.0199 17.2336 17.2497 17.3667 18.4014 18.4869 18.8569 19.0142 19.0819 20.0715 21.0688 21.1063 21.5771 21.7751 21.9948 22.4482 23.5380 23.7612 24.0199 25.1635 25.5897 25.6280 26.0109 26.0902 26.1172 26.3693 26.5668 27.2404 27.3240 27.7314 28.2393 28.5326 28.5470 29.0742 29.6496 29.7781 30.1023 30.7987 30.9932 31.4425 32.6697 33.0509 33.2801 33.9034 33.9464 34.3204 34.3668 34.6296 34.8185 34.9018 35.2708 35.4183 35.5531 36.2995 36.4343 36.8189 37.2520 37.4223 38.7036 39.0419 39.5877 39.7034 40.0341 40.2113 40.8773 40.9837 41.4352 41.7720 41.9227 42.2488 42.9443 43.2616 43.9330 44.5935 46.7581 46.8481 47.8087 48.0682 48.8631 49.1294 49.7732 50.5435 50.7857 51.8165 53.2810 53.3849 53.8581 54.3957 55.2030 55.3843 56.0171 56.1293 56.7406 58.3049 58.6500 58.8458 59.7940 59.9861 60.1338 60.4040 60.6954 61.1209 61.8028 62.3028 63.2343 63.7823 63.9259 64.2458 64.6561 67.1923 67.9416 69.4918 71.0608 71.5462 71.5638 72.8158 73.9752 74.2959 74.5648 74.7551 75.1758 75.5283 75.6138 76.1505 76.4383 77.3258 79.2579 79.7539 81.9675 81.9788 83.2383 86.1382 93.0313 94.0131 95.9607 360.7032 361.3310 372.0691 372.1723 373.6272 373.7336 384.5171 385.0227 385.8401 386.8531 396.0172 396.1863 701.5096 892.6506 893.1204 electronvolt
chargesum: 0.0000000
charge: -0.452494 1.363972 -0.446619 -0.288592 0.387791 -0.315047 -0.220772 -0.217389 -0.271448 -0.488729 0.387108 -0.288142 -0.271594 -0.216825 -0.221730 -0.314175 0.242417 0.231965 0.226947 0.235945 0.235906 0.226928 0.232156 0.242421
charge: -0.235398 0.694653 -0.236561 -0.229939 0.092375 -0.149887 -0.106692 -0.149677 -0.097183 -0.095726 0.092619 -0.230088 -0.097241 -0.149660 -0.106728 -0.149704 0.150480 0.142038 0.140684 0.144186 0.144176 0.140694 0.142086 0.150490
qa: -0.4525 1.3640 -0.4466 -0.2886 0.3878 -0.3150 -0.2208 -0.2174 -0.2714 -0.4887 0.3871 -0.2881 -0.2716 -0.2168 -0.2217 -0.3142 0.2424 0.2320 0.2269 0.2359 0.2359 0.2269 0.2322 0.2424
va: 0.9806 3.7899 0.9891 3.6388 3.7634 3.7892 3.8267 3.8051 3.8502 2.1831 3.7634 3.6382 3.8499 3.8052 3.8269 3.7891 0.9066 0.9075 0.9092 0.9056 0.9057 0.9091 0.9074 0.9065
dispersion: -0.017300286 hartree
energy: -1024.746496598529 hartree
dipole: -0.39778 0.37237 -0.02542 10.50703 -9.67022 0.83681 3.11760 -2.80684 0.31077
magnitude: 0.89301 au
magnitude: 2.26986 debye
temp: 298.15 k
press: 1.00 atm
zeropoint: 0.17715681 hartree
thermalvibcorrection: 0.00949629 hartree
thermalrotcorrection: 0.00141627 hartree
thermaltrasncorrection: 0.00141627 hartree
thermaltotal: -1024.55701095 hartree
thermalcorr: 0.01232884 hartree
nonthermalcorr: 0.17715681 hartree
totalcorr: 0.18948565 hartree
thermalcorrenthalpy: 0.00094421 hartree
totalenthalpy: -1024.55606674 hartree
vibrat: 0.01609165 hartree
rotat: 0.01541115 hartree
transl: 0.02007696 hartree
total: 0.05157976 hartree
totalentropycorr: -0.05157976 hartree
gibbsenthalpy: -1024.60764650 hartree
gibbsminuselec: 0.13885010 hartree
