program: Orca
programVersion: 5.0.4
elementType: Si F F P H H H
charge: 0
multiplicity: 1
keywords: Opt RIJCOSX PBEh-3c
formula: H3F2PSi
InChI: InChI=1/F2HSi.H2P/c1-3-2;/h3H;1H2
7 atoms
Si -0.791002 0.098535 0.072872
F  -1.567053 -0.696213 1.234223
F  -1.119272 -0.665122 -1.302979
P  1.389549 0.117597 0.582605
H  -1.327674 1.473307 -0.021736
H  1.667911 -1.151931 0.02591
H  1.747642 0.823926 -0.590795
totalener: -831.32943372 hartree
nucrepener: 228.13524706 hartree
electener: -1059.46468078 hartree
oneelecener: -1608.15517615 hartree
twoeener: 548.69049537 hartree
kineticenergy: 828.99880451 hartree
exchangeener: -35.993057176544 hartree
correlationener: -2.430016849863 hartree
xcener: -38.423074026407 hartree
dispersion: -0.002450229 hartree
dispersion: -0.002450290 hartree
dispersion: -0.002450335 hartree
energy: -2115.5061 -1818.8379 -682.9813 -682.9594 -185.6897 -152.4925 -133.7278 -133.7074 -133.6728 -106.0809 -106.0103 -105.9528 -36.0499 -35.5492 -20.1712 -17.3186 -15.3855 -14.9093 -14.5415 -13.7393 -13.3740 -12.8316 -12.3170 -10.5690 -8.8720 0.8662 1.2278 2.2101 2.7162 2.9000 4.4527 6.6097 9.5124 10.7808 12.0836 12.6610 12.7286 13.1951 14.1558 14.2974 15.4346 17.6929 18.4513 18.9579 20.2514 20.7607 20.9580 23.0630 25.7262 29.0171 31.2213 32.6258 33.0224 33.3243 33.6573 33.9532 34.2508 34.8135 35.2826 35.7899 36.8599 37.4271 39.7981 41.5104 43.0203 44.1322 46.6795 48.0471 78.5129 79.7081 891.1825 891.7465 electronvolt
chargesum: 0.0000000
charge: 1.108999 -0.463012 -0.461927 -0.352776 -0.042769 0.112849 0.098636
charge: 0.523670 -0.248320 -0.248712 -0.102640 -0.033369 0.057516 0.051853
qa: 1.1090 -0.4630 -0.4619 -0.3528 -0.0428 0.1128 0.0986
va: 3.7382 0.9592 0.9633 2.8990 0.9718 0.9561 0.9573
dispersion: -0.002450323 hartree
energy: -831.321520723148 hartree
dipole: 3.25436 -2.90468 0.34968 2.22715 -1.88951 0.33764 -1.01336 0.73304 -0.28032
magnitude: 0.56112 au
magnitude: 1.42625 debye
