program: Orca
programVersion: 5.0.4
elementType: Si F F P H H H
charge: 0
multiplicity: 1
keywords: SP DSD-BLYP D3BJ def2-QZVPP def2-QZVPP/C def2/J TightSCF
formula: H3F2PSi
InChI: InChI=1/F2HSi.H2P/c1-3-2;/h3H;1H2
7 atoms
Si -0.510151 0.281379 -0.108928
F  -1.286202 -0.51337 1.052423
F  -0.838421 -0.482278 -1.48478
P  1.6704 0.30044 0.400804
H  -1.046822 1.656151 -0.203537
H  1.948763 -0.969087 -0.15589
H  2.028494 1.00677 -0.772595
totalener: -831.63856273 hartree
nucrepener: 228.15044658 hartree
electener: -1059.78900931 hartree
oneelecener: -1608.70911625 hartree
twoeener: 548.92010694 hartree
kineticenergy: 830.63016250 hartree
exchangeener: -19.968151749772 hartree
correlationener: -1.048389662473 hartree
xcener: -21.016541412245 hartree
chargesum: -0.0000000
charge: 1.008682 -0.416574 -0.414169 -0.102629 -0.097519 0.018720 0.003488
charge: -0.567866 0.229419 0.228078 0.528947 -0.122145 -0.148231 -0.148202
qa: 1.0087 -0.4166 -0.4142 -0.1026 -0.0975 0.0187 0.0035
va: 3.9534 0.9632 0.9694 3.0017 0.9728 1.0089 1.0125
total: -832.052529785 hartree
dispersion: -0.005376129 hartree
energy: -832.057905914010 hartree
dipole: 3.25436 -2.78889 0.46548 2.22715 -1.78954 0.43761 -1.01336 0.86461 -0.14874
magnitude: 0.65597 au
magnitude: 1.66734 debye
