program: Orca
programVersion: 5.0.4
elementType: Si P H H H
charge: 2
multiplicity: 1
keywords: Opt RIJCOSX PBEh-3c
formula: H3PSi
InChI: InChI=1/H2P.HSi/h1H2;1H
5 atoms
Si 1.128768 -0.012184 -0.149232
P  -0.938318 0.00985 0.558476
H  2.608927 -0.03069 0.007367
H  -1.412975 -1.089845 -0.209788
H  -1.386302 1.12287 -0.206823
totalener: -630.94397777 hartree
nucrepener: 75.02769555 hartree
electener: -705.97167332 hartree
oneelecener: -1007.00345496 hartree
twoeener: 301.03178165 hartree
kineticenergy: 630.10054750 hartree
exchangeener: -24.318678948910 hartree
correlationener: -1.478041869447 hartree
xcener: -25.796720818357 hartree
dispersion: -0.001630334 hartree
dispersion: -0.001630604 hartree
dispersion: -0.001630983 hartree
dispersion: -0.001631052 hartree
dispersion: -0.001630668 hartree
dispersion: -0.001629503 hartree
dispersion: -0.001628436 hartree
dispersion: -0.001626515 hartree
dispersion: -0.001625642 hartree
dispersion: -0.001625682 hartree
dispersion: -0.001625943 hartree
energy: -2129.1412 -1833.1166 -199.2611 -166.9523 -147.3199 -147.2505 -147.2280 -120.5474 -120.4787 -120.1720 -32.9878 -28.5345 -24.8868 -24.4712 -21.5639 -15.8378 -15.8087 -13.2582 -9.7827 -9.6104 -7.1555 -5.7352 -3.3704 -2.9617 -1.2487 -0.7263 -0.7126 -0.5535 -0.4034 1.6208 2.2908 2.3216 3.4371 6.4906 6.8541 7.8590 9.1906 9.3601 13.0813 18.6523 21.2936 21.5047 electronvolt
chargesum: 2.0000000
charge: 1.079945 0.077520 0.246794 0.297984 0.297757
charge: 1.085766 0.358386 0.176097 0.189917 0.189834
qa: 1.0799 0.0775 0.2468 0.2980 0.2978
va: 2.3763 3.1883 0.9355 0.8955 0.8956
dispersion: -0.001626170 hartree
energy: -630.942842213466 hartree
dipole: 0.52203 0.84770 1.36973 -0.00487 -0.00919 -0.01406 -1.25559 0.42778 -0.82781
magnitude: 1.60051 au
magnitude: 4.06818 debye
