program: Orca
programVersion: 5.0.4
elementType: F Si P C C P C C H H H H H H H H H H H H
charge: 1
multiplicity: 1
keywords: Opt RIJCOSX PBEh-3c
formula: C4H12FP2Si
InChI: InChI=1/C4H12FP2Si/c1-6(2)8(5)7(3)4/h1-4H3
20 atoms
F  0.1893 2.551486 -0.125957
Si 0.082957 0.963105 -0.112985
P  -1.832537 0.277498 -0.865534
C  -3.080126 1.438906 -0.162656
C  -2.143523 -1.363244 -0.085192
P  1.872329 -0.000241 0.657236
C  3.291704 0.894554 -0.108216
C  1.876429 -1.695972 -0.069713
H  -4.032799 1.218464 -0.64343
H  -2.820245 2.466108 -0.411029
H  -3.197282 1.340668 0.913667
H  -3.092123 -1.7280 -0.478682
H  -1.382708 -2.080941 -0.386667
H  -2.210625 -1.32712 0.999152
H  4.199018 0.527291 0.370794
H  3.222668 1.960544 0.099596
H  3.37013 0.733968 -1.180519
H  2.743921 -2.21497 0.33766
H  1.945236 -1.709612 -1.154672
H  0.998379 -2.252692 0.252747
totalener: -1229.81871760 hartree
nucrepener: 640.14085747 hartree
electener: -1869.95957506 hartree
oneelecener: -2956.62221910 hartree
twoeener: 1086.66264403 hartree
kineticenergy: 1226.23637640 hartree
exchangeener: -56.195980483086 hartree
correlationener: -4.123881802091 hartree
xcener: -60.319862285177 hartree
dispersion: -0.011440441 hartree
dispersion: -0.011442399 hartree
dispersion: -0.011451551 hartree
dispersion: -0.011495665 hartree
dispersion: -0.011454617 hartree
dispersion: -0.011460371 hartree
dispersion: -0.011454615 hartree
energy: -2120.4355 -2120.4222 -1823.2321 -687.9313 -288.6472 -288.6457 -288.4925 -288.4829 -190.4544 -190.4436 -157.0644 -138.5048 -138.4942 -138.4881 -138.4778 -138.4516 -138.4410 -110.6627 -110.5579 -110.4325 -40.7063 -27.4638 -27.3040 -25.6776 -25.6288 -22.9589 -21.6589 -20.6306 -19.0237 -18.8935 -18.3205 -17.6667 -17.6604 -17.5192 -17.1075 -17.0140 -16.8609 -16.7516 -16.2362 -15.4521 -15.3493 -14.6925 -12.2406 -12.1660 -6.5011 -4.8402 -4.3118 -2.4663 -1.6745 -0.6768 -0.6366 -0.5337 -0.1834 -0.1239 0.7770 1.2403 1.3199 1.4925 1.5076 1.9620 2.2650 2.4755 2.5874 3.0781 3.1979 5.7300 5.8689 6.2046 6.8755 7.2029 7.8311 8.1797 8.5247 8.7763 8.7948 9.2033 9.4037 9.9989 10.4461 10.8515 11.9014 12.2009 12.9082 13.4724 13.7215 14.4138 14.6326 14.7119 15.0814 15.3232 15.6751 15.7538 16.0147 16.9773 17.0014 18.4200 18.6558 19.1561 19.9786 22.9266 23.0646 23.0971 23.3237 23.4916 23.6026 23.8769 24.2053 24.5175 24.8547 24.9178 25.8915 26.4760 26.4981 26.7114 28.0980 29.4455 29.7232 29.8990 30.5794 30.6693 31.2583 31.5167 32.4286 33.4440 37.3056 39.9314 41.6725 43.0806 43.1610 44.1422 44.4693 45.7651 45.8249 46.1471 46.2672 54.1983 54.2328 56.7476 56.7918 58.1784 58.2318 58.5510 58.9335 58.9939 59.1448 59.4128 59.7241 74.3439 368.7991 368.8090 369.4841 369.6331 887.3311 electronvolt
chargesum: 1.0000000
charge: -0.412334 0.971832 0.193736 -0.859746 -0.867668 0.194318 -0.859844 -0.869224 0.304108 0.295945 0.285449 0.309928 0.273966 0.285517 0.304352 0.295786 0.285187 0.310302 0.285262 0.273129
charge: -0.201478 0.550341 0.342871 -0.499912 -0.507191 0.342545 -0.500186 -0.507655 0.172278 0.170530 0.158292 0.174754 0.157748 0.157200 0.172500 0.170319 0.158130 0.174727 0.157003 0.157183
qa: -0.4123 0.9718 0.1937 -0.8597 -0.8677 0.1943 -0.8598 -0.8692 0.3041 0.2959 0.2854 0.3099 0.2740 0.2855 0.3044 0.2958 0.2852 0.3103 0.2853 0.2731
va: 1.0486 3.4492 3.2502 3.6597 3.6647 3.2426 3.6597 3.6639 0.8744 0.8812 0.8792 0.8718 0.8912 0.8785 0.8741 0.8809 0.8793 0.8718 0.8787 0.8915
dispersion: -0.011455450 hartree
energy: -1229.813322983319 hartree
dipole: -0.76899 0.70899 -0.06000 -9.17090 8.32891 -0.84199 0.03144 -0.02917 0.00227
magnitude: 0.84413 au
magnitude: 2.14560 debye
