program: Orca
programVersion: 5.0.4
elementType: F Si F P C C P C C H H H H H H H H H H H H
charge: 0
multiplicity: 1
keywords: Freq RIJCOSX PBEh-3c
frequency: 0.00 0.00 0.00 0.00 0.00 0.00 33.37 43.16 92.00 108.94 135.61 155.17 189.94 190.85 192.87 203.64 215.01 226.80 254.03 269.84 281.95 299.57 307.40 429.89 576.81 684.26 688.48 727.29 734.98 874.05 878.14 879.42 926.96 930.32 953.26 968.00 971.90 1019.27 1021.65 1380.91 1383.64 1399.16 1400.72 1514.89 1518.03 1525.38 1528.22 1528.91 1530.73 1534.94 1541.81 3112.30 3117.55 3123.45 3127.60 3202.05 3207.74 3215.08 3216.91 3218.82 3221.98 3225.85 3230.03
frequency: 33.37 43.16 92.00 108.94 135.61 155.17 189.94 190.85 192.87 203.64 215.01 226.80 254.03 269.84 281.95 299.57 307.40 429.89 576.81 684.26 688.48 727.29 734.98 874.05 878.14 879.42 926.96 930.32 953.26 968.00 971.90 1019.27 1021.65 1380.91 1383.64 1399.16 1400.72 1514.89 1518.03 1525.38 1528.22 1528.91 1530.73 1534.94 1541.81 3112.30 3117.55 3123.45 3127.60 3202.05 3207.74 3215.08 3216.91 3218.82 3221.98 3225.85 3230.03
formula: C4H12F2P2Si
InChI: InChI=1/2C2H6P.F2Si/c3*1-3-2/h2*1-2H3;
21 atoms
F  0.792386 0.789394 2.257937
Si -0.078882 -0.203577 1.323554
F  -0.239007 -1.580545 2.150946
P  -2.120583 0.666004 1.019028
C  -2.777736 -0.663269 -0.106374
C  -1.655981 1.943505 -0.25351
P  1.004074 -0.677805 -0.590853
C  2.242192 -1.912527 0.035549
C  2.062423 0.842896 -0.729464
H  -3.739648 -0.337819 -0.503325
H  -2.953278 -1.578136 0.458145
H  -2.118945 -0.89063 -0.945441
H  -1.117637 1.532136 -1.109078
H  -1.053821 2.729199 0.201648
H  -2.567114 2.410533 -0.627298
H  2.814941 -1.564904 0.89423
H  2.936564 -2.147001 -0.770996
H  1.732159 -2.834974 0.307611
H  1.446721 1.708935 -0.97053
H  2.759763 0.705268 -1.555637
H  2.631308 1.063216 0.172158
totalener: -1329.83381429 hartree
nucrepener: 798.95303771 hartree
electener: -2128.78685201 hartree
oneelecener: -3429.36866190 hartree
twoeener: 1300.58180990 hartree
kineticenergy: 1325.47652079 hartree
exchangeener: -62.015697738614 hartree
correlationener: -4.600333987687 hartree
xcener: -66.616031726300 hartree
energy: -2115.2730 -2115.2317 -1818.4119 -682.7110 -682.7031 -284.3490 -284.3145 -284.2651 -284.2087 -185.2835 -185.2497 -152.0128 -133.3356 -133.3200 -133.2996 -133.2817 -133.2760 -133.2408 -105.6108 -105.5250 -105.4645 -35.7240 -35.2407 -22.9770 -22.7926 -21.3485 -21.2756 -18.1297 -16.9627 -16.1618 -15.1176 -14.4041 -14.3502 -13.6713 -13.5724 -13.3743 -13.2646 -13.1878 -13.1075 -12.7928 -12.6763 -12.5909 -12.5193 -10.8391 -10.7348 -10.6823 -9.4680 -7.8587 -7.2448 0.4506 1.2301 1.7248 2.1760 2.8886 3.1720 3.7342 3.9616 4.1477 4.6989 4.9242 5.2209 5.4260 5.5462 5.7191 6.0924 6.1189 6.2858 6.7245 7.3176 8.5033 9.9595 11.1354 11.3357 11.5558 11.9204 12.3220 12.6407 12.8841 13.2906 13.6730 13.8699 14.0994 14.7409 15.7965 16.2170 16.6070 17.3676 17.9823 18.5557 18.6377 18.8045 19.0491 19.2275 19.7767 20.0669 20.3209 20.7665 21.4358 21.5146 22.1724 22.3040 23.1510 24.0444 24.9106 26.6819 27.0632 27.3459 27.5699 27.7451 27.8761 28.0952 28.5094 28.6646 29.1341 29.5460 29.6525 30.2785 30.8468 31.4960 31.5494 32.9732 33.2470 33.8408 34.1576 34.3360 34.8833 35.0182 35.9401 36.3406 36.7106 37.0690 37.3108 38.2988 39.0198 40.1455 43.0081 46.2268 47.2641 47.5413 47.8034 47.9384 48.7438 49.1101 49.7489 50.1637 50.3602 50.7125 52.0216 58.3301 58.4132 60.7098 60.8415 62.7583 62.8354 62.9640 63.2014 63.2534 63.4373 63.8671 64.3993 79.3029 80.2165 373.0440 373.3444 374.2314 374.4020 891.5355 893.4297 electronvolt
chargesum: -0.0000000
charge: -0.450490 1.171528 -0.453302 0.107177 -0.879683 -0.884205 0.059953 -0.855768 -0.864600 0.256113 0.257188 0.258039 0.246068 0.253217 0.262845 0.248268 0.251675 0.259439 0.246283 0.254136 0.256118
charge: -0.253989 0.487550 -0.251686 0.218710 -0.524996 -0.525902 0.194360 -0.517890 -0.519529 0.142816 0.146343 0.138167 0.131389 0.143869 0.144690 0.135790 0.141351 0.148018 0.140327 0.141867 0.138744
qa: -0.4505 1.1715 -0.4533 0.1072 -0.8797 -0.8842 0.0600 -0.8558 -0.8646 0.2561 0.2572 0.2580 0.2461 0.2532 0.2628 0.2483 0.2517 0.2594 0.2463 0.2541 0.2561
va: 0.9826 3.7135 0.9745 2.9477 3.6843 3.6908 2.9334 3.7024 3.6982 0.8970 0.8969 0.8956 0.8957 0.8973 0.8941 0.8947 0.8968 0.8968 0.9021 0.8964 0.8939
dispersion: -0.012675214 hartree
energy: -1329.825244540831 hartree
dipole: 2.29998 -2.00119 0.29880 2.21630 -2.06434 0.15196 -13.41994 12.51485 -0.90508
magnitude: 0.96516 au
magnitude: 2.45325 debye
temp: 298.15 k
press: 1.00 atm
zeropoint: 0.16510230 hartree
thermalvibcorrection: 0.01146900 hartree
thermalrotcorrection: 0.00141627 hartree
thermaltrasncorrection: 0.00141627 hartree
thermaltotal: -1329.64584070 hartree
thermalcorr: 0.01430154 hartree
nonthermalcorr: 0.16510230 hartree
totalcorr: 0.17940384 hartree
thermalcorrenthalpy: 0.00094421 hartree
totalenthalpy: -1329.64489649 hartree
vibrat: 0.02070683 hartree
rotat: 0.01457473 hartree
transl: 0.01976657 hartree
total: 0.05504813 hartree
totalentropycorr: -0.05504813 hartree
gibbsenthalpy: -1329.69994462 hartree
gibbsminuselec: 0.12529992 hartree
