program: Orca
programVersion: 5.0.4
elementType: O Si P C C P C C H H H H H H H H H H H H
charge: 0
multiplicity: 1
keywords: Opt RIJCOSX PBEh-3c
formula: C4H12OP2Si
InChI: InChI=1/2C2H6P.OSi/c2*1-3-2;1-2/h2*1-2H3;
20 atoms
O  0.442624 -2.56635 -0.056674
Si 0.180637 -1.060209 -0.005865
P  -1.574729 -0.063027 -0.964203
C  -2.810586 -1.441365 -0.912486
C  -2.146555 1.038325 0.422436
P  1.533852 0.410291 1.002602
C  1.683095 1.6819 -0.349599
C  3.140226 -0.503028 0.854515
H  -3.733527 -1.111903 -1.388489
H  -2.425041 -2.288939 -1.476585
H  -3.037063 -1.779732 0.097152
H  -3.032383 1.579253 0.090603
H  -1.384861 1.781088 0.657509
H  -2.395945 0.501131 1.336225
H  2.389836 2.446434 -0.027375
H  2.026359 1.277582 -1.300588
H  0.727124 2.178229 -0.513844
H  3.065308 -1.447761 1.390081
H  3.929763 0.086676 1.319429
H  3.421667 -0.718395 -0.174843
totalener: -1205.45164863 hartree
nucrepener: 632.35854135 hartree
electener: -1837.81018998 hartree
oneelecener: -2921.31517235 hartree
twoeener: 1083.50498236 hartree
kineticenergy: 1201.95996121 hartree
exchangeener: -55.302327118665 hartree
correlationener: -4.106874669716 hartree
xcener: -59.409201788381 hartree
dispersion: -0.012234722 hartree
dispersion: -0.012295481 hartree
dispersion: -0.012253856 hartree
dispersion: -0.012137528 hartree
dispersion: -0.012221260 hartree
dispersion: -0.012261763 hartree
dispersion: -0.012239697 hartree
dispersion: -0.012242114 hartree
dispersion: -0.012241871 hartree
dispersion: -0.012239767 hartree
energy: -2115.5100 -2115.5033 -1816.7570 -528.9506 -284.5538 -284.5424 -284.3138 -284.2976 -185.5249 -185.5157 -150.7335 -133.5745 -133.5649 -133.5597 -133.5497 -133.5209 -133.5117 -104.3544 -104.1622 -104.1494 -27.2971 -23.0937 -22.9212 -21.4939 -21.4320 -17.8022 -17.0121 -14.2153 -13.6774 -13.6422 -13.3923 -13.0148 -12.8057 -12.7856 -12.7619 -12.3983 -11.0524 -10.9873 -10.2678 -10.1969 -9.5676 -8.7884 -7.8557 -7.2145 -0.9319 0.4765 0.7333 1.9073 2.7869 3.2497 3.4317 3.8953 4.0358 4.3202 4.9124 5.0799 5.1048 5.3547 5.5858 6.0421 6.1313 6.6458 6.8204 7.2393 7.9896 10.2806 10.4364 11.0411 11.3486 12.0796 12.1672 12.4096 12.5601 13.2519 13.2954 13.5271 14.5455 14.6889 15.4619 15.8777 16.7074 16.8836 17.7093 18.2363 18.4172 18.5733 18.8840 18.9441 19.2644 19.7738 20.4106 20.9893 21.1344 21.9273 22.0076 23.0381 23.2707 24.0068 24.9797 26.5025 27.1245 27.2568 27.4013 27.6163 28.0718 28.1182 28.2194 28.4981 28.6330 29.1316 29.6716 29.9599 30.6982 31.0478 31.5970 31.7260 34.1546 34.3146 35.6600 35.9551 36.5306 37.1202 47.2502 47.3967 47.7853 48.2003 49.7110 50.0754 50.1297 50.5513 52.7811 52.8535 54.1642 58.1032 58.1304 58.3474 59.8254 60.7180 60.7710 62.4479 62.6084 62.8320 63.0899 63.3022 63.4993 63.6520 63.8525 75.2087 372.9512 373.1700 373.9538 374.0076 696.2271 electronvolt
chargesum: 0.0000000
charge: -0.588396 0.740116 0.101528 -0.851254 -0.865398 0.100215 -0.866907 -0.851167 0.251385 0.274984 0.249670 0.261510 0.252197 0.250936 0.262076 0.251184 0.251948 0.274419 0.250891 0.250062
charge: -0.431427 0.352506 0.213682 -0.513075 -0.519361 0.211072 -0.519963 -0.512825 0.141072 0.157192 0.138016 0.145097 0.142063 0.136651 0.145264 0.136624 0.141719 0.156806 0.140661 0.138227
qa: -0.5884 0.7401 0.1015 -0.8513 -0.8654 0.1002 -0.8669 -0.8512 0.2514 0.2750 0.2497 0.2615 0.2522 0.2509 0.2621 0.2512 0.2519 0.2744 0.2509 0.2501
va: 2.1522 3.9245 2.9729 3.7008 3.6981 2.9650 3.6973 3.7005 0.8963 0.8908 0.8953 0.8922 0.9003 0.8932 0.8923 0.8929 0.9002 0.8910 0.8966 0.8951
dispersion: -0.012236167 hartree
energy: -1205.447470897724 hartree
dipole: -0.88922 0.63323 -0.25599 4.79812 -3.44211 1.35602 -0.04346 0.07541 0.03195
magnitude: 1.38034 au
magnitude: 3.50855 debye
