program: Orca
programVersion: 5.0.4
elementType: O Si P C C P C C H H H H H H H H H H H H
charge: 0
multiplicity: 1
keywords: SP DSD-BLYP D3BJ def2-QZVPP def2-QZVPP/C def2/J TightSCF
formula: C4H12OP2Si
InChI: InChI=1/2C2H6P.OSi/c2*1-3-2;1-2/h2*1-2H3;
20 atoms
O  0.38949 -2.276054 -0.058514
Si 0.127503 -0.769913 -0.007705
P  -1.627863 0.227269 -0.966043
C  -2.86372 -1.151069 -0.914326
C  -2.199689 1.328621 0.420595
P  1.480719 0.700587 1.000761
C  1.629961 1.972197 -0.351439
C  3.087092 -0.212731 0.852675
H  -3.786661 -0.821607 -1.390329
H  -2.478175 -1.998643 -1.478425
H  -3.090197 -1.489436 0.095312
H  -3.085517 1.86955 0.088762
H  -1.437995 2.071384 0.655669
H  -2.449079 0.791427 1.334385
H  2.336702 2.73673 -0.029215
H  1.973225 1.567878 -1.302428
H  0.67399 2.468525 -0.515684
H  3.012174 -1.157465 1.388241
H  3.876629 0.376972 1.317589
H  3.368533 -0.428099 -0.176683
totalener: -1205.64670567 hartree
nucrepener: 632.37260704 hartree
electener: -1838.01931271 hartree
oneelecener: -2921.84934688 hartree
twoeener: 1083.83003417 hartree
kineticenergy: 1204.18211536 hartree
exchangeener: -30.697456777549 hartree
correlationener: -1.737794545769 hartree
xcener: -32.435251323318 hartree
chargesum: -0.0000000
charge: -0.635736 0.658072 0.003080 -0.254394 -0.257056 0.003724 -0.259234 -0.257142 0.080186 0.109408 0.068317 0.086041 0.075945 0.078555 0.084706 0.079338 0.077344 0.110505 0.080265 0.068077
charge: -0.000344 -0.363478 0.476783 0.098418 0.088534 0.474295 0.087340 0.098181 -0.084133 -0.069408 -0.079923 -0.081219 -0.082811 -0.082164 -0.081172 -0.082240 -0.083039 -0.069742 -0.084352 -0.079526
qa: -0.6357 0.6581 0.0031 -0.2544 -0.2571 0.0037 -0.2592 -0.2571 0.0802 0.1094 0.0683 0.0860 0.0759 0.0786 0.0847 0.0793 0.0773 0.1105 0.0803 0.0681
va: 2.0509 4.1320 3.0567 3.8770 3.8778 3.0520 3.8760 3.8796 0.9962 0.9997 0.9937 0.9963 1.0052 0.9916 0.9961 0.9910 1.0057 0.9987 0.9964 0.9944
total: -1206.377909520 hartree
dispersion: -0.021117756 hartree
energy: -1206.399027275419 hartree
dipole: -0.88922 0.58737 -0.30185 4.79812 -3.17631 1.62181 -0.04346 0.08613 0.04267
magnitude: 1.65021 au
magnitude: 4.19451 debye
