program: Orca
programVersion: 5.0.4
elementType: Si P C C C C H H H H H H H H H H H
charge: 2
multiplicity: 1
keywords: Opt RIJCOSX PBEh-3c
formula: C4H11PSi
InChI: InChI=1/C4H10P.HSi/c1-3-5-4-2;/h3-4H2,1-2H3;1H
17 atoms
Si -1.459962 2.847879 -0.233224
P  -0.327072 0.939499 -0.412513
C  1.175012 0.74481 0.568168
C  2.114373 -0.263135 -0.138761
C  -1.246919 -0.595083 -0.649838
C  -1.416346 -1.422403 0.637873
H  -1.234581 3.66725 -1.46051
H  1.655391 1.716173 0.69831
H  0.878355 0.371311 1.557531
H  2.414087 0.060612 -1.133334
H  1.696884 -1.266538 -0.186246
H  3.017445 -0.314096 0.470541
H  -0.642312 -1.148068 -1.388677
H  -2.195427 -0.374318 -1.144156
H  -1.954556 -2.328491 0.357795
H  -0.466199 -1.730867 1.068038
H  -2.008173 -0.904635 1.389103
totalener: -787.96735731 hartree
nucrepener: 357.87440147 hartree
electener: -1145.84175878 hartree
oneelecener: -1771.69559704 hartree
twoeener: 625.85383826 hartree
kineticenergy: 785.68760375 hartree
exchangeener: -37.460031840320 hartree
correlationener: -2.843511302430 hartree
xcener: -40.303543142750 hartree
dispersion: -0.008991040 hartree
dispersion: -0.009001267 hartree
dispersion: -0.009016460 hartree
dispersion: -0.009016901 hartree
dispersion: -0.008986565 hartree
dispersion: -0.008950912 hartree
dispersion: -0.008999584 hartree
dispersion: -0.009024519 hartree
dispersion: -0.009058652 hartree
dispersion: -0.009048579 hartree
dispersion: -0.009028816 hartree
dispersion: -0.009046795 hartree
dispersion: -0.009044594 hartree
dispersion: -0.009044551 hartree
dispersion: -0.009041523 hartree
energy: -2128.1899 -1829.0418 -294.5666 -294.5282 -292.5805 -292.5209 -198.1199 -162.9784 -146.2233 -146.1124 -146.1010 -116.5651 -116.4285 -116.2604 -34.1783 -32.5617 -29.9385 -28.4421 -27.3644 -25.4209 -23.7403 -23.6058 -22.3648 -22.1747 -21.5564 -20.8562 -20.1951 -20.1160 -19.8807 -19.6872 -18.5369 -14.0337 -13.3780 -9.3309 -7.9773 -7.2926 -6.5695 -5.5372 -4.9139 -3.9760 -3.8047 -3.2746 -3.1911 -2.8375 -2.7277 -2.3406 -1.9920 -1.5600 -1.1926 -1.0827 0.2593 0.8117 1.1078 1.6004 1.6467 1.9689 2.5663 3.7147 4.2803 4.8214 5.6636 6.1337 6.2076 6.7944 7.0757 7.7367 7.8784 8.4855 9.3891 9.6260 10.1551 11.0669 11.1439 12.1335 12.2872 14.2307 14.4917 16.5916 17.1812 18.1041 18.2323 19.3115 19.8328 20.1612 20.4490 20.9515 20.9830 21.4510 22.2771 22.9833 23.3476 24.9235 30.4800 31.0889 34.0093 34.1719 35.7723 37.4984 43.9212 44.1308 44.8224 45.8308 45.9410 46.8017 52.7182 53.3720 53.9567 54.8362 56.0668 56.1703 56.8425 57.0849 61.8118 61.8409 362.1329 362.7422 369.1792 369.3769 electronvolt
chargesum: 2.0000000
charge: 0.746508 0.528641 -0.703715 -0.679799 -0.707282 -0.658653 0.177780 0.356012 0.373329 0.292312 0.277632 0.356852 0.375346 0.357424 0.351120 0.274530 0.281963
charge: 0.653265 0.793108 -0.368796 -0.353811 -0.370087 -0.351439 0.124496 0.193948 0.212405 0.166951 0.158946 0.203461 0.220439 0.195597 0.200220 0.158429 0.162866
qa: 0.7465 0.5286 -0.7037 -0.6798 -0.7073 -0.6587 0.1778 0.3560 0.3733 0.2923 0.2776 0.3569 0.3753 0.3574 0.3511 0.2745 0.2820
va: 2.3588 3.5007 3.5804 3.5571 3.5864 3.5643 0.9620 0.8386 0.8254 0.8796 0.8885 0.8533 0.8254 0.8376 0.8556 0.8903 0.8859
dispersion: -0.009040530 hartree
energy: -787.967839274827 hartree
dipole: 4.82927 -5.57563 -0.74636 -10.11944 11.77914 1.65970 1.71257 -2.03504 -0.32247
magnitude: 1.84815 au
magnitude: 4.69762 debye
