program: Orca
programVersion: 5.0.4
elementType: C C P C C Si F P C C C C H H H H H H H H H H H H H H H H H H H H
charge: 1
multiplicity: 1
keywords: SP DSD-BLYP D3BJ def2-QZVPP def2-QZVPP/C def2/J TightSCF
formula: C8H20FP2Si
InChI: InChI=1/C4H10FPSi.C4H10P/c1-3-6(4-2)7-5;1-3-5-4-2/h3-4H2,1-2H3;3-4H2,1-2H3
32 atoms
C  3.230157 2.598023 0.133227
C  2.007813 1.732292 0.424126
P  1.783721 0.503351 -0.951705
C  3.228536 -0.652118 -0.894856
C  3.607579 -1.21512 0.464391
Si 0.073637 -0.727715 -0.397272
F  0.125426 -2.182094 -1.051618
P  -1.930152 -0.007441 -0.003948
C  -1.809207 1.088103 1.493664
C  -2.862621 2.189715 1.457123
C  -2.961765 -1.485055 0.434028
C  -4.438932 -1.10806 0.501372
H  4.151371 2.016137 0.127246
H  3.335254 3.35699 0.907164
H  3.145902 3.111151 -0.824012
H  1.112005 2.355781 0.450085
H  2.102799 1.243375 1.392871
H  3.02177 -1.444119 -1.617025
H  4.056485 -0.081622 -1.32389
H  3.815767 -0.432723 1.193325
H  4.508387 -1.821856 0.378628
H  2.822626 -1.855018 0.870418
H  -1.908477 0.467898 2.385951
H  -0.812442 1.532016 1.529862
H  -3.875158 1.790082 1.438502
H  -2.74303 2.831241 0.585666
H  -2.775541 2.812643 2.346579
H  -2.798473 -2.229369 -0.347204
H  -2.62622 -1.916381 1.377129
H  -5.032813 -2.00364 0.678052
H  -4.785737 -0.656989 -0.427338
H  -4.64923 -0.417035 1.316186
totalener: -1386.79542830 hartree
nucrepener: 1078.27542635 hartree
electener: -2465.07085466 hartree
oneelecener: -4037.94311525 hartree
twoeener: 1572.87226059 hartree
kineticenergy: 1384.91261021 hartree
exchangeener: -38.528084845489 hartree
correlationener: -2.308773757449 hartree
xcener: -40.836858602938 hartree
chargesum: 1.0000000
charge: -0.164017 -0.131256 0.133805 -0.132399 -0.146698 0.729416 -0.364391 0.148119 -0.157244 -0.129333 -0.143297 -0.166452 0.062131 0.082895 0.086754 0.065394 0.072825 0.093363 0.078903 0.067840 0.088535 0.050341 0.083635 0.057784 0.066475 0.076113 0.077656 0.089047 0.082011 0.089205 0.085211 0.067631
charge: 0.225409 -0.027061 0.613784 -0.020212 0.223367 -0.189216 0.271220 0.626446 -0.016106 0.220654 -0.011631 0.224370 -0.057892 -0.050365 -0.053778 -0.063780 -0.067133 -0.051509 -0.053571 -0.058982 -0.047863 -0.062203 -0.057393 -0.065105 -0.060636 -0.057147 -0.052133 -0.053352 -0.061488 -0.049955 -0.055091 -0.061646
qa: -0.1640 -0.1313 0.1338 -0.1324 -0.1467 0.7294 -0.3644 0.1481 -0.1572 -0.1293 -0.1433 -0.1665 0.0621 0.0829 0.0868 0.0654 0.0728 0.0934 0.0789 0.0678 0.0885 0.0503 0.0836 0.0578 0.0665 0.0761 0.0777 0.0890 0.0820 0.0892 0.0852 0.0676
va: 3.9016 3.8356 3.2922 3.8644 3.8874 3.6617 1.0461 3.3226 3.8792 3.8875 3.8616 3.8993 0.9985 0.9978 0.9948 0.9935 0.9834 0.9933 1.0030 1.0020 1.0029 0.9983 0.9870 0.9998 1.0001 0.9954 0.9984 0.9896 0.9874 0.9974 0.9959 0.9986
total: -1387.889897002 hartree
dispersion: -0.029100456 hartree
energy: -1387.918997458274 hartree
dipole: 0.07165 0.11378 0.18542 9.74325 -9.51479 0.22846 13.51994 -12.57428 0.94566
magnitude: 0.99037 au
magnitude: 2.51733 debye
