program: Orca
programVersion: 5.0.4
elementType: C C P C C Si P C C C C O H H H H H H H H H H H H H H H H H H H H
charge: 0
multiplicity: 1
keywords: Freq RIJCOSX PBEh-3c
frequency: 0.00 0.00 0.00 0.00 0.00 0.00 22.79 37.87 66.20 70.41 79.35 84.85 92.78 101.07 128.00 140.01 147.31 157.37 202.75 234.42 256.70 260.96 269.87 276.00 294.09 328.01 347.66 351.91 400.13 407.82 537.15 646.67 677.50 690.06 690.99 761.92 774.18 786.72 793.14 1018.79 1022.03 1022.51 1030.32 1046.21 1049.17 1057.88 1063.23 1079.91 1095.07 1115.66 1121.74 1231.48 1303.62 1306.65 1314.16 1315.97 1316.87 1328.49 1335.22 1342.14 1467.24 1468.04 1469.55 1470.28 1509.44 1517.70 1519.41 1528.27 1539.61 1549.23 1549.63 1549.72 1556.51 1561.07 1563.38 1563.93 3107.98 3114.65 3117.67 3118.39 3119.70 3120.58 3122.55 3122.88 3166.94 3167.53 3177.77 3182.43 3184.78 3195.46 3201.80 3203.30 3203.69 3210.79 3219.20 3221.45
frequency: 22.79 37.87 66.20 70.41 79.35 84.85 92.78 101.07 128.00 140.01 147.31 157.37 202.75 234.42 256.70 260.96 269.87 276.00 294.09 328.01 347.66 351.91 400.13 407.82 537.15 646.67 677.50 690.06 690.99 761.92 774.18 786.72 793.14 1018.79 1022.03 1022.51 1030.32 1046.21 1049.17 1057.88 1063.23 1079.91 1095.07 1115.66 1121.74 1231.48 1303.62 1306.65 1314.16 1315.97 1316.87 1328.49 1335.22 1342.14 1467.24 1468.04 1469.55 1470.28 1509.44 1517.70 1519.41 1528.27 1539.61 1549.23 1549.63 1549.72 1556.51 1561.07 1563.38 1563.93 3107.98 3114.65 3117.67 3118.39 3119.70 3120.58 3122.55 3122.88 3166.94 3167.53 3177.77 3182.43 3184.78 3195.46 3201.80 3203.30 3203.69 3210.79 3219.20 3221.45
formula: C8H20OP2Si
InChI: InChI=1/2C4H10P.OSi/c2*1-3-5-4-2;1-2/h2*3-4H2,1-2H3;
32 atoms
C  2.844189 -1.377773 2.386137
C  2.960994 -0.661796 1.046237
P  1.541479 -1.105963 -0.075259
C  1.869925 -0.12203 -1.629741
C  2.133084 1.368612 -1.47802
Si -0.07853 0.161088 0.806101
P  -1.793881 0.5120 -0.599666
C  -3.058321 1.137212 0.619854
C  -2.788979 2.576703 1.035927
C  -2.392278 -1.241768 -0.88026
C  -1.584089 -1.996533 -1.925218
O  -0.026312 0.734055 2.226264
H  1.972103 -1.032012 2.939485
H  2.765087 -2.457494 2.25848
H  3.721957 -1.179031 3.001512
H  3.869919 -0.976438 0.52638
H  3.035287 0.414169 1.203867
H  1.017836 -0.290449 -2.292596
H  2.719371 -0.610323 -2.114467
H  2.951148 1.572614 -0.788676
H  1.248938 1.895361 -1.111169
H  2.394364 1.817194 -2.437525
H  -4.022662 1.067394 0.109299
H  -3.112545 0.492224 1.497661
H  -2.715752 3.236241 0.17086
H  -1.866047 2.654228 1.608398
H  -3.597352 2.946791 1.666951
H  -3.421166 -1.125411 -1.230927
H  -2.449831 -1.809551 0.050048
H  -2.053759 -2.953628 -2.153743
H  -0.57172 -2.213114 -1.58062
H  -1.512456 -1.432571 -2.855576
totalener: -1362.37487884 hartree
nucrepener: 1094.06561643 hartree
electener: -2456.44049527 hartree
oneelecener: -4052.13633303 hartree
twoeener: 1595.69583776 hartree
kineticenergy: 1357.46460606 hartree
exchangeener: -68.436681926810 hartree
correlationener: -5.475896462753 hartree
xcener: -73.912578389563 hartree
energy: -2115.3334 -2115.2995 -1816.7473 -528.9107 -284.6811 -284.6575 -284.4232 -284.3883 -284.1223 -284.0377 -283.7076 -283.6762 -185.3259 -185.2991 -150.6874 -133.3743 -133.3631 -133.3472 -133.3348 -133.3238 -133.2952 -104.3094 -104.1136 -104.1093 -27.2507 -23.9824 -23.8647 -23.1840 -23.1753 -20.2188 -20.1528 -19.0270 -18.7220 -17.4542 -16.6612 -14.5523 -14.3065 -14.0108 -13.8239 -13.6660 -13.6037 -13.0524 -12.7408 -12.6053 -12.0650 -11.9047 -11.6273 -11.5040 -11.4575 -11.3177 -10.9846 -10.8942 -10.2315 -10.1913 -9.8441 -9.7195 -9.4773 -8.5380 -7.6867 -7.1407 -0.8690 0.4001 0.8066 2.0403 2.7787 3.3387 3.3874 3.8204 4.1915 4.1986 4.5080 4.7482 4.7765 5.1271 5.2353 5.3296 5.4440 5.6185 5.8848 5.9594 6.0479 6.1673 6.3756 6.4713 6.6051 6.6954 6.8355 6.9943 7.1851 7.2833 7.5316 7.8015 8.9576 10.4193 10.9801 11.3824 11.4515 12.1769 12.4207 12.7954 12.8402 13.3822 13.5801 13.9559 14.0074 14.2518 14.7999 14.9452 15.3044 15.5557 15.9261 15.9710 16.0986 16.3642 16.5764 17.2743 17.5791 17.8491 18.3412 18.7513 19.0828 19.2525 19.4974 20.2418 20.4250 20.7441 20.9789 21.4789 22.1044 22.3495 22.5164 22.6262 23.0164 23.2433 23.7393 24.6005 24.7348 25.1317 26.0167 26.9653 27.0250 27.4635 27.5568 27.7663 27.7991 27.8835 28.2061 28.2331 28.4062 28.5560 28.7402 28.9777 29.2053 29.4587 29.8678 29.9611 30.1434 30.2023 30.9013 31.0616 31.3211 31.4241 32.3232 32.4568 33.5411 33.6094 33.9799 35.3223 35.6842 37.2861 39.7112 40.3862 40.9936 41.4779 43.0678 43.4024 44.0791 44.3576 45.0155 45.1997 45.9807 46.3722 52.7568 52.9651 53.5797 53.7138 54.0017 54.3461 54.7156 54.8569 54.9135 55.1341 55.2308 55.3795 55.5693 55.7410 55.9936 58.4608 59.7821 61.4352 61.6402 62.6171 62.7051 64.1659 64.5437 64.8326 64.9951 65.3223 65.3782 65.5403 65.6202 65.6797 65.7759 65.9840 66.1208 71.0803 71.7665 72.1672 72.4235 75.4105 371.2263 371.7498 372.2592 372.5341 379.2771 379.4074 379.6568 379.8036 696.6685 electronvolt
chargesum: -0.0000000
charge: -0.656112 -0.630054 0.109067 -0.651108 -0.642773 0.700339 0.111947 -0.627418 -0.657875 -0.639513 -0.658350 -0.597637 0.265426 0.218930 0.228597 0.242736 0.257475 0.260069 0.256799 0.228260 0.230982 0.236293 0.240961 0.257832 0.217192 0.264549 0.228367 0.252338 0.248629 0.236695 0.242983 0.224377
charge: -0.374403 -0.379304 0.219417 -0.389727 -0.370949 0.343864 0.210461 -0.377659 -0.375689 -0.381078 -0.376958 -0.439268 0.146818 0.127528 0.131139 0.134512 0.136223 0.141728 0.140649 0.129456 0.130086 0.133811 0.133256 0.137403 0.126749 0.146345 0.131268 0.138860 0.131343 0.133741 0.130331 0.130046
qa: -0.6561 -0.6301 0.1091 -0.6511 -0.6428 0.7003 0.1119 -0.6274 -0.6579 -0.6395 -0.6583 -0.5976 0.2654 0.2189 0.2286 0.2427 0.2575 0.2601 0.2568 0.2283 0.2310 0.2363 0.2410 0.2578 0.2172 0.2645 0.2284 0.2523 0.2486 0.2367 0.2430 0.2244
va: 3.6900 3.7194 2.9825 3.7161 3.6971 3.9444 2.9357 3.7187 3.6914 3.7192 3.6957 2.1376 0.9026 0.9111 0.9097 0.8928 0.8858 0.8898 0.8891 0.9072 0.9075 0.9053 0.8938 0.8844 0.9115 0.9040 0.9097 0.8889 0.8856 0.9056 0.9044 0.9102
dispersion: -0.021505765 hartree
energy: -1362.359235586155 hartree
dipole: 1.36052 -1.36095 -0.00043 0.99894 -1.40635 -0.40741 -2.82062 1.67718 -1.14344
magnitude: 1.21385 au
magnitude: 3.08535 debye
temp: 298.15 k
press: 1.00 atm
zeropoint: 0.28088980 hartree
thermalvibcorrection: 0.01561272 hartree
thermalrotcorrection: 0.00141627 hartree
thermaltrasncorrection: 0.00141627 hartree
thermaltotal: -1362.05990052 hartree
thermalcorr: 0.01844527 hartree
nonthermalcorr: 0.28088980 hartree
totalcorr: 0.29933507 hartree
thermalcorrenthalpy: 0.00094421 hartree
totalenthalpy: -1362.05895631 hartree
vibrat: 0.02867855 hartree
rotat: 0.01535132 hartree
transl: 0.02000252 hartree
total: 0.06403239 hartree
totalentropycorr: -0.06403239 hartree
gibbsenthalpy: -1362.12298870 hartree
gibbsminuselec: 0.23624689 hartree
