program: Orca
programVersion: 5.0.4
elementType: C C P C C Si P C C C C O H H H H H H H H H H H H H H H H H H H H
charge: 0
multiplicity: 1
keywords: SP DSD-BLYP D3BJ def2-QZVPP def2-QZVPP/C def2/J TightSCF
formula: C8H20OP2Si
InChI: InChI=1/2C4H10P.OSi/c2*1-3-5-4-2;1-2/h2*3-4H2,1-2H3;
32 atoms
C  2.890324 -1.351121 2.269619
C  3.007128 -0.635144 0.929719
P  1.587613 -1.079311 -0.191777
C  1.91606 -0.095378 -1.74626
C  2.179218 1.395264 -1.594538
Si -0.032396 0.18774 0.689582
P  -1.747746 0.538652 -0.716184
C  -3.012186 1.163865 0.503336
C  -2.742845 2.603355 0.919408
C  -2.346144 -1.215116 -0.996778
C  -1.537955 -1.96988 -2.041737
O  0.019822 0.760707 2.109746
H  2.018237 -1.00536 2.822967
H  2.811221 -2.430842 2.141962
H  3.768091 -1.152379 2.884994
H  3.916054 -0.949786 0.409862
H  3.081421 0.440821 1.087349
H  1.06397 -0.263797 -2.409114
H  2.765505 -0.583671 -2.230985
H  2.997282 1.599266 -0.905195
H  1.295072 1.922013 -1.227687
H  2.440498 1.843846 -2.554043
H  -3.976528 1.094046 -0.007219
H  -3.066411 0.518876 1.381143
H  -2.669618 3.262893 0.054342
H  -1.819913 2.68088 1.491879
H  -3.551218 2.973443 1.550433
H  -3.375032 -1.098759 -1.347445
H  -2.403697 -1.782898 -0.066471
H  -2.007624 -2.926976 -2.270261
H  -0.525586 -2.186461 -1.697138
H  -1.466322 -1.405919 -2.972094
totalener: -1362.38163314 hartree
nucrepener: 1094.06561626 hartree
electener: -2456.44724939 hartree
oneelecener: -4052.57871078 hartree
twoeener: 1596.13146138 hartree
kineticenergy: 1360.51228901 hartree
exchangeener: -38.027010605158 hartree
correlationener: -2.298752533359 hartree
xcener: -40.325763138517 hartree
chargesum: -0.0000000
charge: -0.209749 -0.123040 0.025742 -0.138403 -0.153619 0.610915 -0.004889 -0.111879 -0.202857 -0.135697 -0.173725 -0.633846 0.108205 0.064174 0.051279 0.051741 0.050151 0.057292 0.061240 0.068513 0.060458 0.055649 0.049374 0.052308 0.062516 0.107333 0.052115 0.057403 0.052457 0.061439 0.063144 0.064255
charge: 0.202803 -0.037227 0.528450 -0.050728 0.207019 -0.366099 0.526801 -0.037234 0.202269 -0.039846 0.193303 0.004033 -0.056007 -0.067365 -0.065578 -0.071675 -0.070682 -0.068383 -0.069414 -0.063681 -0.062838 -0.061798 -0.072730 -0.067153 -0.067881 -0.057120 -0.065407 -0.068037 -0.072545 -0.064409 -0.075259 -0.065584
qa: -0.2097 -0.1230 0.0257 -0.1384 -0.1536 0.6109 -0.0049 -0.1119 -0.2029 -0.1357 -0.1737 -0.6338 0.1082 0.0642 0.0513 0.0517 0.0502 0.0573 0.0612 0.0685 0.0605 0.0556 0.0494 0.0523 0.0625 0.1073 0.0521 0.0574 0.0525 0.0614 0.0631 0.0643
va: 3.8973 3.8236 3.0714 3.8384 3.8784 4.1803 3.0342 3.8189 3.8914 3.8355 3.8964 2.0555 1.0001 0.9959 1.0001 0.9952 0.9985 1.0097 0.9966 0.9987 0.9999 0.9964 0.9934 0.9925 0.9959 1.0018 0.9990 0.9928 0.9872 0.9975 1.0067 0.9997
total: -1363.483842072 hartree
dispersion: -0.031278534 hartree
energy: -1363.515120606354 hartree
dipole: 1.36052 -1.36828 -0.00776 0.99894 -1.48958 -0.49064 -2.82062 1.46476 -1.35586
magnitude: 1.44192 au
magnitude: 3.66508 debye
