program: Orca
programVersion: 5.0.4
elementType: P Si F P H H H H
charge: 1
multiplicity: 1
keywords: SP DSD-BLYP D3BJ def2-QZVPP def2-QZVPP/C def2/J TightSCF
formula: H4FP2Si
InChI: InChI=1/FSi.2H2P/c1-2;;/h;2*1H2
8 atoms
P  -2.012844 -0.541516 0.075794
Si 0.032255 0.254733 0.153437
F  0.089984 1.832719 0.202239
P  1.920625 -0.706495 -0.430587
H  -2.475534 0.241482 1.156189
H  -1.713652 -1.713886 0.803196
H  1.71883 -1.84862 0.374887
H  2.709374 0.029734 0.481064
totalener: -1073.26997809 hartree
nucrepener: 265.34265464 hartree
electener: -1338.61263274 hartree
oneelecener: -2003.90698889 hartree
twoeener: 665.29435615 hartree
kineticenergy: 1072.23746054 hartree
exchangeener: -23.858450633478 hartree
correlationener: -1.190512495865 hartree
xcener: -25.048963129344 hartree
chargesum: 1.0000000
charge: 0.116597 0.794291 -0.313256 0.118207 0.080111 0.062101 0.062134 0.079816
charge: 0.684935 -0.221527 0.298577 0.684216 -0.107977 -0.115276 -0.114789 -0.108158
qa: 0.1166 0.7943 -0.3133 0.1182 0.0801 0.0621 0.0621 0.0798
va: 3.1386 3.6302 1.1228 3.1369 1.0078 1.0060 1.0059 1.0078
total: -1073.622918024 hartree
dispersion: -0.009705866 hartree
energy: -1073.632623890808 hartree
dipole: 0.22143 -0.16732 0.05411 -3.68529 2.71462 -0.97068 2.76217 -2.16943 0.59274
magnitude: 1.13863 au
magnitude: 2.89417 debye
