program: Orca
programVersion: 5.0.4
elementType: P Si F F P H H H H
charge: 0
multiplicity: 1
keywords: Freq RIJCOSX PBEh-3c
frequency: 0.00 0.00 0.00 0.00 0.00 0.00 108.80 120.77 137.95 180.80 182.73 257.57 278.50 413.67 544.22 711.49 713.67 741.04 771.63 885.99 989.72 1151.13 1154.65 2484.56 2486.27 2493.05 2495.24
frequency: 108.80 120.77 137.95 180.80 182.73 257.57 278.50 413.67 544.22 711.49 713.67 741.04 771.63 885.99 989.72 1151.13 1154.65 2484.56 2486.27 2493.05 2495.24
formula: H4F2P2Si
InChI: InChI=1/F2Si.2H2P/c1-3-2;;/h;2*1H2
9 atoms
P  1.969234 0.13516 -0.068868
Si -0.028751 -0.870837 -0.245348
F  -0.122526 -1.509552 -1.719049
F  0.015133 -2.048836 0.849907
P  -1.965255 0.21782 0.066943
H  1.72197 0.556459 1.259527
H  1.545374 1.35901 -0.636722
H  -1.531493 0.853083 1.254084
H  -1.603686 1.307593 -0.760575
totalener: -1172.89246138 hartree
nucrepener: 373.78437011 hartree
electener: -1546.67683149 hartree
oneelecener: -2371.31656161 hartree
twoeener: 824.63973012 hartree
kineticenergy: 1170.07885935 hartree
exchangeener: -48.868586564749 hartree
correlationener: -3.233930503528 hartree
xcener: -52.102517068276 hartree
energy: -2115.5461 -2115.5393 -1819.0384 -683.0373 -683.0262 -185.7212 -185.7150 -152.6415 -133.7590 -133.7531 -133.7353 -133.7296 -133.7058 -133.6993 -106.2299 -106.1620 -106.1014 -36.0858 -35.6339 -20.5101 -19.7621 -17.0817 -15.5072 -14.6816 -14.5874 -13.8880 -13.5683 -12.5447 -12.3479 -11.6658 -10.5759 -9.7953 -8.1996 0.4097 0.6645 1.4547 2.1657 2.4956 2.7439 2.8987 3.8986 7.3799 8.8678 10.4647 10.9479 11.6912 12.0369 12.2745 13.2404 13.9855 14.2722 14.7111 14.8696 15.4429 15.4747 16.9247 17.6066 18.0580 19.8198 20.2761 20.3763 20.5872 21.1970 21.5462 22.2300 22.9407 25.8149 26.2178 31.0464 31.5745 32.8040 32.9637 33.3528 33.3937 33.6509 33.8838 34.2111 34.9093 35.3836 36.1845 36.4753 37.5226 38.9220 43.0282 44.4385 45.7224 47.3551 49.0411 79.0519 79.2509 890.8699 892.5695 electronvolt
chargesum: -0.0000000
charge: -0.317592 1.152865 -0.451062 -0.452523 -0.315924 0.097736 0.095033 0.096119 0.095347
charge: -0.087878 0.473150 -0.245645 -0.247546 -0.086945 0.050691 0.047037 0.048653 0.048483
qa: -0.3176 1.1529 -0.4511 -0.4525 -0.3159 0.0977 0.0950 0.0961 0.0953
va: 2.9056 3.7900 0.9770 0.9736 2.9071 0.9579 0.9584 0.9580 0.9583
dispersion: -0.004301111 hartree
energy: -1172.886796164805 hartree
dipole: 0.22267 -0.19313 0.02954 6.88780 -5.87486 1.01294 1.87770 -1.61415 0.26355
magnitude: 1.04708 au
magnitude: 2.66147 debye
temp: 298.15 k
press: 1.00 atm
zeropoint: 0.04397653 hartree
thermalvibcorrection: 0.00520698 hartree
thermalrotcorrection: 0.00141627 hartree
thermaltrasncorrection: 0.00141627 hartree
thermaltotal: -1172.83478012 hartree
thermalcorr: 0.00803952 hartree
nonthermalcorr: 0.04397653 hartree
totalcorr: 0.05201605 hartree
thermalcorrenthalpy: 0.00094421 hartree
totalenthalpy: -1172.83383591 hartree
vibrat: 0.00928164 hartree
rotat: 0.01345778 hartree
transl: 0.01926511 hartree
total: 0.04200453 hartree
totalentropycorr: -0.04200453 hartree
gibbsenthalpy: -1172.87584044 hartree
gibbsminuselec: 0.01095573 hartree
