program: Orca
programVersion: 5.0.4
elementType: P Si F F P H H H H
charge: 0
multiplicity: 1
keywords: Opt RIJCOSX PBEh-3c
formula: H4F2P2Si
InChI: InChI=1/F2Si.2H2P/c1-3-2;;/h;2*1H2
9 atoms
P  1.969234 0.13516 -0.068868
Si -0.028751 -0.870837 -0.245348
F  -0.122526 -1.509552 -1.719049
F  0.015133 -2.048836 0.849907
P  -1.965255 0.21782 0.066943
H  1.72197 0.556459 1.259527
H  1.545374 1.35901 -0.636722
H  -1.531493 0.853083 1.254084
H  -1.603686 1.307593 -0.760575
totalener: -1172.89244917 hartree
nucrepener: 373.77323466 hartree
electener: -1546.66568382 hartree
oneelecener: -2371.29847591 hartree
twoeener: 824.63279209 hartree
kineticenergy: 1170.08111883 hartree
exchangeener: -48.868803821488 hartree
correlationener: -3.233922786707 hartree
xcener: -52.102726608195 hartree
dispersion: -0.004295182 hartree
dispersion: -0.004295649 hartree
dispersion: -0.004296717 hartree
dispersion: -0.004300174 hartree
dispersion: -0.004304871 hartree
dispersion: -0.004303102 hartree
dispersion: -0.004302447 hartree
dispersion: -0.004301694 hartree
energy: -2115.5461 -2115.5394 -1819.0386 -683.0375 -683.0260 -185.7212 -185.7150 -152.6417 -133.7590 -133.7531 -133.7353 -133.7297 -133.7058 -133.6993 -106.2301 -106.1622 -106.1015 -36.0858 -35.6339 -20.5101 -19.7621 -17.0818 -15.5073 -14.6817 -14.5874 -13.8881 -13.5683 -12.5447 -12.3480 -11.6658 -10.5760 -9.7953 -8.1996 0.4097 0.6645 1.4546 2.1657 2.4955 2.7438 2.8987 3.8985 7.3799 8.8677 10.4647 10.9478 11.6911 12.0369 12.2744 13.2403 13.9855 14.2721 14.7110 14.8695 15.4429 15.4746 16.9247 17.6066 18.0580 19.8198 20.2760 20.3762 20.5871 21.1970 21.5462 22.2299 22.9407 25.8149 26.2177 31.0464 31.5745 32.8040 32.9637 33.3528 33.3937 33.6508 33.8838 34.2111 34.9093 35.3835 36.1845 36.4752 37.5226 38.9220 43.0282 44.4384 45.7224 47.3551 49.0411 79.0519 79.2508 890.8699 892.5694 electronvolt
chargesum: -0.0000000
charge: -0.317593 1.152882 -0.451060 -0.452533 -0.315926 0.097736 0.095030 0.096117 0.095347
charge: -0.087881 0.473163 -0.245643 -0.247553 -0.086948 0.050692 0.047036 0.048651 0.048484
qa: -0.3176 1.1529 -0.4511 -0.4525 -0.3159 0.0977 0.0950 0.0961 0.0953
va: 2.9056 3.7900 0.9770 0.9735 2.9071 0.9579 0.9584 0.9580 0.9583
dispersion: -0.004301111 hartree
energy: -1172.886796172646 hartree
dipole: 0.22267 -0.19312 0.02956 6.88780 -5.87490 1.01291 1.87770 -1.61417 0.26353
magnitude: 1.04705 au
magnitude: 2.66138 debye
