program: Orca
programVersion: 5.0.4
elementType: C Si F C H H H H H H
charge: 1
multiplicity: 1
keywords: Freq RIJCOSX PBEh-3c
frequency: 0.00 0.00 0.00 0.00 0.00 0.00 82.24 236.21 285.13 293.84 507.15 647.25 750.36 817.52 879.35 933.42 950.89 1072.52 1368.05 1422.73 1460.37 1463.23 1492.51 1495.83 2792.44 2863.55 2955.14 3088.45 3170.27 3217.74
frequency: 82.24 236.21 285.13 293.84 507.15 647.25 750.36 817.52 879.35 933.42 950.89 1072.52 1368.05 1422.73 1460.37 1463.23 1492.51 1495.83 2792.44 2863.55 2955.14 3088.45 3170.27 3217.74
formula: C2H6FSi
InChI: InChI=1/C2H6FSi/c1-4(2)3/h1-2H3
10 atoms
C  1.609075 -0.34576 -0.149701
Si 0.046421 0.402378 0.402169
F  0.191609 1.507406 1.511328
C  -1.649351 0.032407 -0.14249
H  1.475579 -0.963051 -1.03877
H  2.02021 -0.979868 0.645135
H  2.363456 0.419776 -0.351369
H  -1.652997 -0.764229 -0.928665
H  -2.136041 0.96871 -0.557025
H  -2.279549 -0.295693 0.733545
totalener: -468.21972523 hartree
nucrepener: 168.88951528 hartree
electener: -637.10924051 hartree
oneelecener: -972.44633039 hartree
twoeener: 335.33708987 hartree
kineticenergy: 466.18334004 hartree
exchangeener: -23.845895997377 hartree
correlationener: -1.833976198435 hartree
xcener: -25.679872195812 hartree
energy: -1825.0959 -689.3218 -290.1439 -289.8565 -158.8408 -112.5037 -112.3238 -112.1871 -42.1525 -27.9645 -27.1770 -22.5808 -20.3838 -20.3067 -19.4160 -18.5527 -18.4665 -18.2711 -18.2137 -16.6032 -7.2939 -4.9391 -3.3990 -1.2410 -0.9409 -0.5163 -0.2646 -0.0629 0.9000 2.7205 3.0665 6.0009 6.4131 6.6113 6.9847 8.0116 8.4429 9.3610 10.6840 11.2019 11.5303 11.9302 13.0090 18.2573 18.3499 21.2918 21.7640 22.0141 22.4167 23.3088 23.9771 26.4159 27.9735 28.2487 28.5626 28.8944 30.0390 32.6485 35.4583 36.0101 38.4487 42.0724 44.9000 46.0713 46.7776 53.6043 54.7393 55.5412 56.8132 57.2314 58.6269 74.7037 366.7154 367.3373 886.5499 electronvolt
chargesum: 1.0000000
charge: -1.009970 1.405911 -0.390108 -0.998814 0.324011 0.337624 0.340227 0.319586 0.335161 0.336371
charge: -0.558665 1.017520 -0.157889 -0.560233 0.198531 0.213789 0.211461 0.201195 0.217518 0.216772
qa: -1.0100 1.4059 -0.3901 -0.9988 0.3240 0.3376 0.3402 0.3196 0.3352 0.3364
va: 3.6455 3.2832 1.0904 3.6450 0.8659 0.8607 0.8596 0.8708 0.8651 0.8644
dispersion: -0.003421629 hartree
energy: -468.214317168370 hartree
dipole: -0.63243 0.49839 -0.13404 -5.01432 4.16919 -0.84513 -4.93453 4.10013 -0.83440
magnitude: 1.19518 au
magnitude: 3.03790 debye
temp: 298.15 k
press: 1.00 atm
zeropoint: 0.07801856 hartree
thermalvibcorrection: 0.00287968 hartree
thermalrotcorrection: 0.00141627 hartree
thermaltrasncorrection: 0.00141627 hartree
thermaltotal: -468.13058639 hartree
thermalcorr: 0.00571222 hartree
nonthermalcorr: 0.07801856 hartree
totalcorr: 0.08373078 hartree
thermalcorrenthalpy: 0.00094421 hartree
totalenthalpy: -468.12964218 hartree
vibrat: 0.00480160 hartree
rotat: 0.01206460 hartree
transl: 0.01850391 hartree
total: 0.03537011 hartree
totalentropycorr: -0.03537011 hartree
gibbsenthalpy: -468.16501229 hartree
gibbsminuselec: 0.04930488 hartree
