program: Orca
programVersion: 5.0.4
elementType: C Si C H H H H H H
charge: 2
multiplicity: 1
keywords: SP DSD-BLYP D3BJ def2-QZVPP def2-QZVPP/C def2/J TightSCF
formula: C2H6Si
InChI: InChI=1/C2H6Si/c1-3-2/h1-2H3
9 atoms
C  -1.793743 0.043894 -0.070885
Si 0.000024 0.000599 -0.000423
C  1.793714 -0.044753 0.071566
H  -2.137086 -0.158862 -1.117814
H  -2.161633 1.052712 0.24797
H  -2.21833 -0.73555 0.61251
H  2.207395 0.980007 -0.110981
H  2.122872 -0.399925 1.081782
H  2.186467 -0.74482 -0.709804
totalener: -367.97848529 hartree
nucrepener: 97.62674209 hartree
electener: -465.60522738 hartree
oneelecener: -684.81638048 hartree
twoeener: 219.21115310 hartree
kineticenergy: 367.35017698 hartree
exchangeener: -10.006332569729 hartree
correlationener: -0.572891653062 hartree
xcener: -10.579224222791 hartree
chargesum: 2.0000000
charge: -0.224056 1.219146 -0.223340 0.204446 0.204570 0.205626 0.204798 0.203678 0.205133
charge: 0.284736 1.250634 0.284786 0.030066 0.029926 0.029966 0.029882 0.030030 0.029974
qa: -0.2241 1.2191 -0.2233 0.2044 0.2046 0.2056 0.2048 0.2037 0.2051
va: 3.8897 2.8564 3.8898 0.9785 0.9789 0.9781 0.9784 0.9792 0.9784
total: -368.203157367 hartree
dispersion: -0.004657676 hartree
energy: -368.207815043344 hartree
dipole: -0.00030 0.00031 0.00001 -0.00607 0.00611 0.00004 0.00346 -0.00372 -0.00026
magnitude: 0.00026 au
magnitude: 0.00067 debye
