program: Orca
programVersion: 5.0.4
elementType: O Si P C C C C C C C C C C C C P C C C C C C H H H H H H H H H H H H H H H H
charge: 0
multiplicity: 1
keywords: Freq RIJCOSX PBEh-3c
frequency: 0.00 0.00 0.00 0.00 0.00 0.00 24.21 34.30 39.46 45.20 60.78 70.45 73.97 86.24 104.94 137.73 184.44 199.74 213.13 231.28 253.23 263.51 275.75 300.77 373.55 415.69 416.50 420.12 424.55 427.59 460.41 478.54 491.71 513.57 566.35 644.03 644.10 644.84 674.55 715.59 724.78 730.75 732.80 734.43 735.44 776.20 782.48 790.60 892.46 893.04 894.84 903.39 967.76 972.20 975.93 1027.14 1027.69 1030.36 1040.85 1043.78 1044.70 1051.93 1054.20 1055.05 1083.26 1083.59 1085.68 1137.92 1139.98 1145.71 1150.22 1159.98 1160.81 1216.22 1216.30 1216.99 1245.15 1247.56 1248.81 1257.24 1357.83 1365.19 1368.20 1399.76 1400.29 1410.93 1518.54 1521.96 1523.23 1569.21 1570.04 1574.03 1691.20 1693.77 1694.23 1709.99 1711.17 1711.66 2479.47 3249.36 3250.35 3262.39 3264.44 3264.89 3269.46 3272.19 3273.22 3275.82 3281.55 3282.18 3282.30 3290.35 3290.65 3291.03
frequency: 24.21 34.30 39.46 45.20 60.78 70.45 73.97 86.24 104.94 137.73 184.44 199.74 213.13 231.28 253.23 263.51 275.75 300.77 373.55 415.69 416.50 420.12 424.55 427.59 460.41 478.54 491.71 513.57 566.35 644.03 644.10 644.84 674.55 715.59 724.78 730.75 732.80 734.43 735.44 776.20 782.48 790.60 892.46 893.04 894.84 903.39 967.76 972.20 975.93 1027.14 1027.69 1030.36 1040.85 1043.78 1044.70 1051.93 1054.20 1055.05 1083.26 1083.59 1085.68 1137.92 1139.98 1145.71 1150.22 1159.98 1160.81 1216.22 1216.30 1216.99 1245.15 1247.56 1248.81 1257.24 1357.83 1365.19 1368.20 1399.76 1400.29 1410.93 1518.54 1521.96 1523.23 1569.21 1570.04 1574.03 1691.20 1693.77 1694.23 1709.99 1711.17 1711.66 2479.47 3249.36 3250.35 3262.39 3264.44 3264.89 3269.46 3272.19 3273.22 3275.82 3281.55 3282.18 3282.30 3290.35 3290.65 3291.03
formula: C18H16OP2Si
InChI: InChI=1/C12H10P.C6H6P.OSi/c1-3-7-11(8-4-1)13-12-9-5-2-6-10-12;7-6-4-2-1-3-5-6;1-2/h1-10H;1-5,7H;
38 atoms
O  0.486798 3.41968 1.953725
Si 0.648162 1.989359 1.44026
P  -0.099016 1.336026 -0.573046
C  -0.335622 -0.452956 -0.26663
C  0.189713 -1.344258 -1.197422
C  0.031627 -2.712463 -1.031158
C  -0.64621 -3.204311 0.072451
C  -1.170943 -2.324554 1.010532
C  -1.021639 -0.95838 0.839343
C  -1.80764 2.005438 -0.540404
C  -2.023197 3.354764 -0.261094
C  -3.299096 3.889202 -0.346928
C  -4.371426 3.094042 -0.723977
C  -4.159549 1.754816 -1.011823
C  -2.886885 1.210775 -0.922321
P  1.760907 0.412345 2.59591
C  2.601053 -0.480226 1.229974
C  2.530298 -1.870126 1.243971
C  3.138514 -2.616583 0.245959
C  3.81805 -1.981838 -0.781335
C  3.894515 -0.595712 -0.805464
C  3.293671 0.149866 0.195714
H  0.729443 -0.965671 -2.056082
H  0.44281 -3.393363 -1.764586
H  -0.769478 -4.271504 0.203187
H  -1.702035 -2.702904 1.874022
H  -1.46222 -0.282478 1.563286
H  -1.203034 3.989386 0.0490
H  -3.452847 4.934479 -0.113586
H  -5.365408 3.515758 -0.792497
H  -4.987932 1.124669 -1.308303
H  -2.742509 0.162728 -1.150875
H  2.78905 1.308908 2.971523
H  1.989107 -2.371414 2.036014
H  3.074663 -3.696398 0.270319
H  4.290163 -2.563891 -1.562008
H  4.424251 -0.093412 -1.604058
H  3.373893 1.230399 0.168906
totalener: -1740.15311106 hartree
nucrepener: 2142.70662280 hartree
electener: -3882.85973386 hartree
oneelecener: -6651.36583508 hartree
twoeener: 2768.50610122 hartree
kineticenergy: 1732.49703590 hartree
exchangeener: -96.615816096247 hartree
correlationener: -7.992547531543 hartree
xcener: -104.608363627790 hartree
chargesum: -0.0000000
charge: -0.580198 0.710859 0.205669 -0.216554 -0.229872 -0.200259 -0.233218 -0.210101 -0.222784 -0.175622 -0.257680 -0.203501 -0.234825 -0.199584 -0.251691 -0.057457 -0.174048 -0.234536 -0.197776 -0.234519 -0.206696 -0.233773 0.240384 0.226703 0.227429 0.230547 0.251472 0.267225 0.226319 0.221177 0.219935 0.241703 0.125463 0.238790 0.226098 0.226698 0.230196 0.238024
charge: -0.426915 0.351192 0.301855 -0.197199 -0.118255 -0.127830 -0.125612 -0.133528 -0.131460 -0.184738 -0.133829 -0.127431 -0.135261 -0.132278 -0.142740 0.116532 -0.197881 -0.120431 -0.126373 -0.127196 -0.130970 -0.136501 0.145586 0.139150 0.138813 0.141286 0.143965 0.156412 0.139641 0.136668 0.136743 0.144072 0.061744 0.144754 0.138785 0.138655 0.141087 0.139489
qa: -0.5802 0.7109 0.2057 -0.2166 -0.2299 -0.2003 -0.2332 -0.2101 -0.2228 -0.1756 -0.2577 -0.2035 -0.2348 -0.1996 -0.2517 -0.0575 -0.1740 -0.2345 -0.1978 -0.2345 -0.2067 -0.2338 0.2404 0.2267 0.2274 0.2305 0.2515 0.2672 0.2263 0.2212 0.2199 0.2417 0.1255 0.2388 0.2261 0.2267 0.2302 0.2380
va: 2.1613 3.9726 2.9570 3.7766 3.8165 3.8172 3.8170 3.8256 3.7864 3.7553 3.7821 3.8273 3.8180 3.8328 3.8128 2.9217 3.7531 3.8205 3.8208 3.8193 3.8233 3.8067 0.9143 0.9094 0.9088 0.9082 0.8998 0.9099 0.9089 0.9111 0.9108 0.9060 0.9530 0.9154 0.9094 0.9092 0.9081 0.9046
dispersion: -0.035773659 hartree
energy: -1740.141087332057 hartree
dipole: -4.00581 4.12332 0.11751 -10.26313 8.15914 -2.10399 -6.76049 5.89467 -0.86582
magnitude: 2.27821 au
magnitude: 5.79074 debye
temp: 298.15 k
press: 1.00 atm
zeropoint: 0.29834866 hartree
thermalvibcorrection: 0.01733704 hartree
thermalrotcorrection: 0.00141627 hartree
thermaltrasncorrection: 0.00141627 hartree
thermaltotal: -1739.82256909 hartree
thermalcorr: 0.02016958 hartree
nonthermalcorr: 0.29834866 hartree
totalcorr: 0.31851824 hartree
thermalcorrenthalpy: 0.00094421 hartree
totalenthalpy: -1739.82162488 hartree
vibrat: 0.03084350 hartree
rotat: 0.01648257 hartree
transl: 0.02059759 hartree
total: 0.06792365 hartree
totalentropycorr: -0.06792365 hartree
gibbsenthalpy: -1739.88954853 hartree
gibbsminuselec: 0.25153880 hartree
