program: Orca
programVersion: 5.0.4
elementType: O Si P C C C C C C C C C C C C P C C C C C C H H H H H H H H H H H H H H H H
charge: 0
multiplicity: 1
keywords: Opt RIJCOSX PBEh-3c
formula: C18H16OP2Si
InChI: InChI=1/C12H10P.C6H6P.OSi/c1-3-7-11(8-4-1)13-12-9-5-2-6-10-12;7-6-4-2-1-3-5-6;1-2/h1-10H;1-5,7H;
38 atoms
O  0.486798 3.41968 1.953725
Si 0.648162 1.989359 1.44026
P  -0.099016 1.336026 -0.573046
C  -0.335622 -0.452956 -0.26663
C  0.189713 -1.344258 -1.197422
C  0.031627 -2.712463 -1.031158
C  -0.64621 -3.204311 0.072451
C  -1.170943 -2.324554 1.010532
C  -1.021639 -0.95838 0.839343
C  -1.80764 2.005438 -0.540404
C  -2.023197 3.354764 -0.261094
C  -3.299096 3.889202 -0.346928
C  -4.371426 3.094042 -0.723977
C  -4.15955 1.754816 -1.011823
C  -2.886885 1.210775 -0.922321
P  1.760907 0.412345 2.59591
C  2.601053 -0.480226 1.229974
C  2.530298 -1.870126 1.243971
C  3.138514 -2.616583 0.245959
C  3.81805 -1.981838 -0.781335
C  3.894515 -0.595712 -0.805464
C  3.293671 0.149866 0.195714
H  0.729443 -0.965671 -2.056082
H  0.44281 -3.393363 -1.764586
H  -0.769478 -4.271504 0.203187
H  -1.702035 -2.702904 1.874022
H  -1.46222 -0.282478 1.563286
H  -1.203034 3.989386 0.0490
H  -3.452847 4.934479 -0.113586
H  -5.365408 3.515758 -0.792497
H  -4.987932 1.124669 -1.308303
H  -2.742509 0.162728 -1.150875
H  2.78905 1.308908 2.971523
H  1.989107 -2.371414 2.036014
H  3.074663 -3.696398 0.270319
H  4.290163 -2.563891 -1.562008
H  4.424251 -0.093412 -1.604058
H  3.373893 1.230399 0.168906
totalener: -1740.15315929 hartree
nucrepener: 2141.46331654 hartree
electener: -3881.61647583 hartree
oneelecener: -6648.88733134 hartree
twoeener: 2767.27085551 hartree
kineticenergy: 1732.51256736 hartree
exchangeener: -96.617481784927 hartree
correlationener: -7.992361628547 hartree
xcener: -104.609843413474 hartree
dispersion: -0.035667644 hartree
dispersion: -0.036233471 hartree
dispersion: -0.035730518 hartree
dispersion: -0.035655371 hartree
dispersion: -0.035783856 hartree
dispersion: -0.035750266 hartree
dispersion: -0.035563845 hartree
dispersion: -0.035833891 hartree
dispersion: -0.035840638 hartree
dispersion: -0.035633926 hartree
dispersion: -0.035778021 hartree
dispersion: -0.035722706 hartree
dispersion: -0.035756874 hartree
dispersion: -0.035776497 hartree
dispersion: -0.035774463 hartree
chargesum: -0.0000000
charge: -0.580211 0.710907 0.205593 -0.216465 -0.229819 -0.200269 -0.233238 -0.210114 -0.222812 -0.175654 -0.257780 -0.203521 -0.234810 -0.199542 -0.251625 -0.057538 -0.173946 -0.234449 -0.197776 -0.234546 -0.206737 -0.233850 0.240371 0.226697 0.227434 0.230546 0.251472 0.267248 0.226329 0.221180 0.219929 0.241703 0.125481 0.238773 0.226094 0.226706 0.230203 0.238035
charge: -0.426920 0.351223 0.301800 -0.197134 -0.118216 -0.127836 -0.125629 -0.133541 -0.131476 -0.184759 -0.133902 -0.127450 -0.135245 -0.132247 -0.142688 0.116471 -0.197805 -0.120366 -0.126370 -0.127219 -0.131004 -0.136557 0.145578 0.139149 0.138815 0.141287 0.143962 0.156424 0.139647 0.136669 0.136740 0.144070 0.061757 0.144743 0.138782 0.138658 0.141093 0.139496
qa: -0.5802 0.7109 0.2056 -0.2165 -0.2298 -0.2003 -0.2332 -0.2101 -0.2228 -0.1757 -0.2578 -0.2035 -0.2348 -0.1995 -0.2516 -0.0575 -0.1739 -0.2344 -0.1978 -0.2345 -0.2067 -0.2338 0.2404 0.2267 0.2274 0.2305 0.2515 0.2672 0.2263 0.2212 0.2199 0.2417 0.1255 0.2388 0.2261 0.2267 0.2302 0.2380
va: 2.1613 3.9725 2.9570 3.7766 3.8165 3.8172 3.8170 3.8256 3.7864 3.7553 3.7821 3.8273 3.8180 3.8329 3.8128 2.9217 3.7531 3.8205 3.8209 3.8192 3.8233 3.8067 0.9143 0.9094 0.9088 0.9082 0.8998 0.9099 0.9089 0.9111 0.9108 0.9060 0.9530 0.9154 0.9094 0.9092 0.9081 0.9046
dispersion: -0.035773659 hartree
energy: -1740.141087355043 hartree
dipole: -4.00581 4.12309 0.11727 -10.26313 8.15874 -2.10440 -6.76049 5.89465 -0.86584
magnitude: 2.27858 au
magnitude: 5.79169 debye
