program: Orca
programVersion: 5.0.4
elementType: C Si F C C C C C C H H H H H H H H
charge: 1
multiplicity: 1
keywords: Opt RIJCOSX PBEh-3c
formula: C7H8FSi
InChI: InChI=1/C7H8FSi/c1-9(8)7-5-3-2-4-6-7/h2-6H,1H3
17 atoms
C  3.158263 0.331848 -0.233017
Si 1.721275 -0.689449 0.237641
F  2.072642 -2.105488 0.837372
C  -0.009223 -0.296214 0.128721
C  -0.404005 0.909615 -0.48219
C  -1.744773 1.216781 -0.584348
C  -2.694198 0.336662 -0.074762
C  -2.316005 -0.853725 0.538706
C  -0.979789 -1.179568 0.639916
H  2.867965 1.207424 -0.81265
H  3.880231 -0.24823 -0.811103
H  3.67952 0.680571 0.663459
H  0.327147 1.60276 -0.880287
H  -2.05544 2.136868 -1.058872
H  -3.744633 0.582413 -0.15678
H  -3.066965 -1.52324 0.933626
H  -0.692211 -2.108927 1.114468
totalener: -659.55092441 hartree
nucrepener: 482.72524834 hartree
electener: -1142.27617275 hartree
oneelecener: -1849.93881641 hartree
twoeener: 707.66264365 hartree
kineticenergy: 656.14596926 hartree
exchangeener: -38.733018903181 hartree
correlationener: -3.238173089547 hartree
xcener: -41.971191992727 hartree
dispersion: -0.009711939 hartree
dispersion: -0.009711391 hartree
dispersion: -0.009708146 hartree
dispersion: -0.009705012 hartree
dispersion: -0.009705373 hartree
dispersion: -0.009704255 hartree
dispersion: -0.009702887 hartree
dispersion: -0.009702903 hartree
energy: -1824.0768 -688.5688 -289.5882 -289.5017 -289.3863 -289.2808 -289.0764 -288.7891 -288.7506 -157.8149 -111.4508 -111.3161 -111.1828 -41.3980 -30.8451 -27.7578 -27.6054 -26.9895 -23.5281 -23.2787 -21.9038 -20.7729 -19.5982 -19.5600 -19.0257 -18.7178 -18.1993 -17.9513 -17.8805 -17.7210 -16.7037 -16.3577 -15.5044 -15.1480 -13.0895 -12.6885 -6.8134 -4.2065 -4.0287 -3.7819 -2.7293 -0.6399 -0.0870 0.3842 0.5958 0.7304 1.1483 1.5481 1.7498 2.6542 3.0727 3.4630 4.1765 4.6080 4.9408 5.5687 6.6145 6.9281 7.8703 8.1263 8.9540 9.3032 9.9929 10.1981 10.6185 11.5857 11.6992 11.7331 12.0826 12.5100 12.5602 12.7005 12.8608 13.4630 13.7421 14.2860 14.6528 15.0200 16.2841 16.9722 18.2543 20.0553 21.0270 21.3185 21.8070 22.2993 22.3828 22.8641 23.3603 23.8549 24.0404 24.2982 25.0370 25.3481 25.7792 26.0564 27.2839 28.7110 28.9861 29.3238 29.5248 30.0112 30.6185 30.7781 31.4193 32.3568 33.1130 35.2850 36.1824 37.4228 37.4660 37.7927 37.9091 38.4889 39.7835 41.9030 44.2132 44.9628 45.8762 46.9139 48.0711 51.1996 51.3860 53.5860 53.7012 54.7203 55.1431 55.4708 55.4975 56.1000 57.7125 58.6393 59.5357 59.7339 60.2332 65.4681 67.2196 69.5242 70.0169 70.4991 70.9549 71.6525 72.6725 76.1418 79.0215 89.0204 356.2139 366.5497 367.5472 368.5648 378.7800 380.0131 390.8708 887.4347 electronvolt
chargesum: 1.0000000
charge: -1.017179 1.334062 -0.401259 -0.210226 -0.235051 -0.193800 -0.195263 -0.194132 -0.242434 0.309102 0.328713 0.326948 0.253254 0.282552 0.290310 0.284606 0.279797
charge: -0.556438 0.960118 -0.171326 -0.245666 -0.078665 -0.109847 -0.043119 -0.107221 -0.069476 0.189420 0.203919 0.205683 0.154105 0.166569 0.168729 0.167508 0.165709
qa: -1.0172 1.3341 -0.4013 -0.2102 -0.2351 -0.1938 -0.1953 -0.1941 -0.2424 0.3091 0.3287 0.3269 0.2533 0.2826 0.2903 0.2846 0.2798
va: 3.6525 3.3678 1.0749 3.6730 3.7853 3.7947 3.7571 3.7767 3.7918 0.8764 0.8663 0.8670 0.9010 0.8869 0.8829 0.8861 0.8904
dispersion: -0.009703479 hartree
energy: -659.541048155917 hartree
dipole: -2.25489 3.12789 0.87300 6.58470 -5.88570 0.69900 -2.70779 2.39534 -0.31245
magnitude: 1.16119 au
magnitude: 2.95150 debye
