program: Orca
programVersion: 5.0.4
elementType: C Si F F C C C C C C H H H H H H H H
charge: 0
multiplicity: 1
keywords: Freq RIJCOSX PBEh-3c
frequency: 0.00 0.00 0.00 0.00 0.00 0.00 22.40 92.33 122.91 155.81 209.53 225.04 254.61 324.86 340.69 411.36 426.35 499.31 645.49 691.70 736.62 754.21 788.36 816.83 842.81 904.82 915.05 977.74 983.44 1034.33 1043.61 1061.32 1087.45 1140.95 1187.63 1218.50 1256.21 1362.35 1374.34 1409.73 1509.21 1512.97 1515.82 1579.13 1692.76 1718.54 3122.60 3208.92 3216.43 3249.79 3260.76 3269.60 3279.97 3289.18
frequency: 22.40 92.33 122.91 155.81 209.53 225.04 254.61 324.86 340.69 411.36 426.35 499.31 645.49 691.70 736.62 754.21 788.36 816.83 842.81 904.82 915.05 977.74 983.44 1034.33 1043.61 1061.32 1087.45 1140.95 1187.63 1218.50 1256.21 1362.35 1374.34 1409.73 1509.21 1512.97 1515.82 1579.13 1692.76 1718.54 3122.60 3208.92 3216.43 3249.79 3260.76 3269.60 3279.97 3289.18
formula: C7H8F2Si
InChI: InChI=1/C7H8F2Si/c1-10(8,9)7-5-3-2-4-6-7/h2-6H,1H3
18 atoms
C  -2.854169 0.71292 0.253751
Si -1.763376 -0.702358 -0.244636
F  -2.094198 -1.074516 -1.777338
F  -2.110339 -1.989476 0.663559
C  0.052866 -0.358362 -0.115048
C  0.686079 0.41726 -1.0888
C  2.033821 0.724393 -0.988729
C  2.771044 0.259713 0.090754
C  2.159033 -0.514558 1.065019
C  0.810153 -0.821033 0.961761
H  -3.912098 0.482061 0.127233
H  -2.694676 0.984806 1.297555
H  -2.634998 1.597802 -0.34544
H  0.131191 0.78055 -1.946189
H  2.510767 1.322607 -1.75401
H  3.82361 0.498469 0.170394
H  2.73379 -0.884348 1.903963
H  0.3514 -1.436031 1.726102
totalener: -759.57916625 hartree
nucrepener: 601.79760535 hartree
electener: -1361.37677160 hartree
oneelecener: -2241.23926010 hartree
twoeener: 879.86248851 hartree
kineticenergy: 755.47978453 hartree
exchangeener: -44.563622945673 hartree
correlationener: -3.713510075445 hartree
xcener: -48.277133021118 hartree
energy: -1818.3073 -682.6050 -682.5345 -284.6876 -284.6572 -284.6244 -284.5391 -284.5274 -284.3776 -283.8350 -151.8630 -105.4681 -105.4040 -105.3149 -35.6152 -35.1441 -26.2770 -23.0845 -23.0723 -21.6305 -18.8125 -18.7979 -16.9843 -16.1308 -15.0915 -14.4411 -14.2670 -14.1906 -14.1061 -13.4604 -13.3888 -13.0069 -12.8957 -12.5574 -12.4877 -11.8159 -11.3271 -11.0822 -9.8243 -8.3541 -8.2787 -0.2161 0.2505 2.7145 2.8431 3.5944 4.0177 4.9938 5.0601 5.2435 5.2739 5.6299 5.8775 6.6062 6.7796 7.0046 8.1439 8.5742 8.7081 8.8016 9.9314 11.8462 12.2425 12.6616 13.0420 13.8435 14.2955 14.5433 15.0966 15.6767 15.9928 16.4565 16.6700 16.9334 16.9830 17.1052 17.4930 17.7713 18.1077 18.5307 19.2922 20.3785 21.2091 21.4434 22.3945 23.6834 23.7382 24.2972 25.7066 26.0195 26.0987 26.5743 27.4672 27.5199 27.8520 28.4214 28.5043 28.6498 29.5257 29.6491 30.7149 31.1141 32.1930 32.9844 33.6692 34.1173 34.2632 34.4266 35.0261 35.1182 35.4884 36.2956 36.4937 36.9597 37.4633 37.9199 38.4237 39.6399 40.0030 41.2307 41.6595 41.8793 42.1220 42.4142 42.9404 46.2492 47.3338 48.1054 48.5290 49.9881 50.4425 51.4169 51.9857 53.0858 55.2109 56.0497 58.0804 59.2924 59.5825 59.7211 60.1208 60.2519 60.6837 63.7653 63.9918 64.2765 64.5483 65.1485 70.0742 71.5160 74.1301 74.7732 75.1291 75.5402 76.2123 77.1324 80.1733 80.8122 84.1015 93.6863 360.6331 371.2087 371.7601 373.5799 383.8797 384.3706 395.7347 891.7554 893.8771 electronvolt
chargesum: -0.0000000
charge: -0.986141 1.356449 -0.455826 -0.457670 -0.175480 -0.271016 -0.206535 -0.227088 -0.203837 -0.270833 0.255692 0.253059 0.249684 0.227950 0.224419 0.227066 0.224503 0.235604
charge: -0.568562 0.711355 -0.243569 -0.243609 -0.202105 -0.117322 -0.133941 -0.119951 -0.133836 -0.117055 0.157559 0.156738 0.155952 0.139769 0.138578 0.138659 0.138609 0.142731
qa: -0.9861 1.3564 -0.4558 -0.4577 -0.1755 -0.2710 -0.2065 -0.2271 -0.2038 -0.2708 0.2557 0.2531 0.2497 0.2280 0.2244 0.2271 0.2245 0.2356
va: 3.6857 3.7578 0.9721 0.9711 3.6418 3.8438 3.8145 3.8196 3.8069 3.8403 0.9008 0.8994 0.9008 0.9095 0.9095 0.9087 0.9095 0.9089
dispersion: -0.010170462 hartree
energy: -759.565224595165 hartree
dipole: 6.44756 -5.96348 0.48407 8.47627 -7.67873 0.79754 3.02588 -2.71597 0.30991
magnitude: 0.98308 au
magnitude: 2.49880 debye
temp: 298.15 k
press: 1.00 atm
zeropoint: 0.13838582 hartree
thermalvibcorrection: 0.00716874 hartree
thermalrotcorrection: 0.00141627 hartree
thermaltrasncorrection: 0.00141627 hartree
thermaltotal: -759.41683749 hartree
thermalcorr: 0.01000128 hartree
nonthermalcorr: 0.13838582 hartree
totalcorr: 0.14838710 hartree
thermalcorrenthalpy: 0.00094421 hartree
totalenthalpy: -759.41589328 hartree
vibrat: 0.01261396 hartree
rotat: 0.01430181 hartree
transl: 0.01952108 hartree
total: 0.04643685 hartree
totalentropycorr: -0.04643685 hartree
gibbsenthalpy: -759.46233013 hartree
gibbsminuselec: 0.10289446 hartree
