program: Orca
programVersion: 5.0.4
elementType: C Si C C C C C C H H H H H H H H
charge: 2
multiplicity: 1
keywords: SP DSD-BLYP D3BJ def2-QZVPP def2-QZVPP/C def2/J TightSCF
formula: C7H8Si
InChI: InChI=1/C7H8Si/c1-8-7-5-3-2-4-6-7/h2-6H,1H3
16 atoms
C  -3.55057 0.566461 0.010054
Si -1.762673 0.27082 -0.003851
C  -0.049305 0.000453 -0.003768
C  0.640662 -0.126616 -1.251452
C  1.995326 -0.330849 -1.224574
C  2.669382 -0.410557 0.001239
C  1.997354 -0.289055 1.224533
C  0.642718 -0.083997 1.246616
H  -4.092706 -0.334705 -0.302364
H  -3.86195 0.832271 1.031859
H  -3.799173 1.406491 -0.652371
H  0.127966 -0.066538 -2.204014
H  2.541657 -0.430213 -2.153151
H  3.740682 -0.571783 0.003128
H  2.545145 -0.356761 2.15509
H  0.131803 0.008395 2.197578
totalener: -559.22342770 hartree
nucrepener: 375.08115246 hartree
electener: -934.30458016 hartree
oneelecener: -1485.38454375 hartree
twoeener: 551.07996359 hartree
kineticenergy: 558.20634544 hartree
exchangeener: -18.306593338971 hartree
correlationener: -1.163516446303 hartree
xcener: -19.470109785274 hartree
chargesum: 2.0000000
charge: -0.240920 1.027836 0.073787 -0.034201 -0.055080 0.040429 -0.056520 -0.030620 0.185018 0.168553 0.180044 0.118167 0.163066 0.181627 0.163544 0.115271
charge: 0.291795 1.117213 -0.168153 0.146759 0.156434 0.237925 0.156220 0.146653 0.000534 0.005515 0.002294 -0.023709 -0.018963 -0.007804 -0.018975 -0.023737
qa: -0.2409 1.0278 0.0738 -0.0342 -0.0551 0.0404 -0.0565 -0.0306 0.1850 0.1686 0.1800 0.1182 0.1631 0.1816 0.1635 0.1153
va: 3.9021 3.1165 3.6037 3.8115 3.8373 3.7707 3.8389 3.8103 0.9848 0.9931 0.9871 0.9830 0.9733 0.9576 0.9731 0.9831
total: -559.844408795 hartree
dispersion: -0.013207697 hartree
energy: -559.857616492178 hartree
dipole: -2.40134 -0.67742 -3.07877 0.44162 0.04991 0.49153 0.07129 -0.06089 0.01040
magnitude: 3.11777 au
magnitude: 7.92475 debye
