program: Orca
programVersion: 5.0.4
elementType: F Si C C C C C C C C C C C C H H H H H H H H H H
charge: 1
multiplicity: 1
keywords: Freq RIJCOSX PBEh-3c
frequency: 0.00 0.00 0.00 0.00 0.00 0.00 36.21 43.91 75.09 111.44 144.21 156.22 256.61 270.61 324.27 375.03 405.65 406.65 447.83 478.57 520.01 634.89 636.12 712.76 713.59 716.15 786.85 788.13 790.60 897.82 900.33 998.56 1001.90 1003.64 1035.62 1040.77 1047.81 1050.15 1080.64 1080.91 1082.19 1082.31 1148.36 1154.97 1176.23 1191.74 1232.42 1233.16 1258.66 1263.73 1367.90 1378.40 1420.69 1423.39 1514.18 1519.25 1566.43 1568.89 1675.53 1678.81 1698.90 1703.07 3270.39 3275.17 3277.47 3278.44 3288.40 3288.55 3300.57 3300.86 3305.92 3305.96
frequency: 36.21 43.91 75.09 111.44 144.21 156.22 256.61 270.61 324.27 375.03 405.65 406.65 447.83 478.57 520.01 634.89 636.12 712.76 713.59 716.15 786.85 788.13 790.60 897.82 900.33 998.56 1001.90 1003.64 1035.62 1040.77 1047.81 1050.15 1080.64 1080.91 1082.19 1082.31 1148.36 1154.97 1176.23 1191.74 1232.42 1233.16 1258.66 1263.73 1367.90 1378.40 1420.69 1423.39 1514.18 1519.25 1566.43 1568.89 1675.53 1678.81 1698.90 1703.07 3270.39 3275.17 3277.47 3278.44 3288.40 3288.55 3300.57 3300.86 3305.92 3305.96
formula: C12H10FSi
InChI: InChI=1/C12H10FSi/c13-14(11-7-3-1-4-8-11)12-9-5-2-6-10-12/h1-10H
24 atoms
F  -0.032033 -2.709044 0.566134
Si -0.014508 -1.170709 0.199176
C  1.622889 -0.48569 -0.034731
C  1.807172 0.739645 -0.698341
C  3.080835 1.241667 -0.873806
C  4.175438 0.536143 -0.386763
C  4.006731 -0.678357 0.267461
C  2.738922 -1.198107 0.43903
C  -1.634768 -0.417936 0.093145
C  -1.780758 0.979959 0.057664
C  -3.040581 1.538246 -0.02007
C  -4.160044 0.714639 -0.064954
C  -4.029635 -0.668415 -0.022145
C  -2.775393 -1.24014 0.061811
H  0.966457 1.288807 -1.102727
H  3.225566 2.177892 -1.394228
H  5.171572 0.934914 -0.5245
H  4.865668 -1.220292 0.637584
H  2.622326 -2.149859 0.941279
H  -0.919661 1.633413 0.115552
H  -3.155517 2.612872 -0.039927
H  -5.145421 1.156647 -0.127348
H  -4.907824 -1.297983 -0.05046
H  -2.687334 -2.318211 0.101064
totalener: -850.87301137 hartree
nucrepener: 878.30237191 hartree
electener: -1729.17538328 hartree
oneelecener: -2891.52289022 hartree
twoeener: 1162.34750694 hartree
kineticenergy: 845.96285603 hartree
exchangeener: -53.600487154735 hartree
correlationener: -4.641704201544 hartree
xcener: -58.242191356279 hartree
energy: -1823.4426 -688.0489 -289.1700 -289.1655 -289.0553 -289.0488 -288.9726 -288.9672 -288.6541 -288.6425 -288.4224 -288.4164 -288.3821 -288.3768 -157.1562 -110.7779 -110.6734 -110.5341 -40.8750 -30.4802 -30.4028 -27.4225 -27.2191 -27.1955 -27.1127 -23.4277 -22.9659 -22.8731 -22.7423 -21.4896 -20.3584 -20.2970 -19.0415 -19.0285 -18.7199 -18.3973 -18.2667 -18.1784 -17.6383 -17.4712 -17.3496 -16.6846 -16.0409 -15.8925 -15.3419 -15.1433 -15.0847 -14.4621 -12.9248 -12.4227 -12.3003 -12.2940 -6.5003 -4.3452 -3.7795 -3.6983 -3.5177 -2.6803 -2.3161 0.2547 0.2842 0.8723 0.9126 1.3060 1.4292 1.8498 1.9073 2.1608 2.2326 2.6860 3.2225 3.4651 3.6154 4.0360 4.5394 4.6231 4.9058 5.1193 5.2124 5.4996 5.5623 7.0026 8.1034 8.4478 9.0055 9.3259 10.1002 10.3198 10.4358 10.5067 11.5068 11.6014 11.8885 11.9483 12.2794 12.4864 12.4997 12.5586 12.7613 12.9174 12.9795 13.1198 13.2410 13.2951 13.5922 13.9948 14.2865 14.6618 14.7749 14.8987 15.3417 15.7763 15.9078 16.4610 16.4971 17.2675 17.7543 18.8908 19.4422 21.5645 21.6208 21.9011 22.0775 22.1572 22.4637 22.7300 22.9663 23.2063 23.6451 23.9820 24.2901 24.3359 24.5168 24.6332 24.8094 25.5651 25.7001 25.8394 26.5242 27.2266 27.4391 27.8361 27.9173 29.7130 29.8074 29.9630 30.5549 30.6032 31.0324 31.3834 31.3971 31.7247 31.7933 32.4582 33.2177 33.6791 35.6138 35.6988 36.7572 37.3506 37.7797 37.8680 38.0976 38.2210 38.2459 38.6590 38.8789 39.2736 41.1339 41.5712 42.8177 45.5116 45.5843 46.8571 47.0061 47.4613 48.0997 51.1444 51.8109 51.8471 51.9425 53.8710 54.0041 54.2971 54.8908 55.4217 55.5444 55.6212 55.8402 55.8955 55.9349 56.2126 56.2201 59.8606 60.0048 60.1798 60.3295 60.5657 60.6637 65.5933 66.0305 67.2969 67.8102 69.6174 69.9670 70.0241 70.6407 70.9039 70.9737 71.5654 71.8084 72.0447 72.1196 73.1694 73.2606 76.9661 79.4283 79.6538 89.5322 89.5547 356.6575 357.2950 367.0007 367.0344 368.4203 368.5445 379.4017 379.4364 380.4400 380.4662 391.3791 391.4451 888.0752 electronvolt
chargesum: 1.0000000
charge: -0.410538 1.293024 -0.208207 -0.249527 -0.192706 -0.200919 -0.196625 -0.253559 -0.209153 -0.248496 -0.192743 -0.200642 -0.196432 -0.253503 0.250229 0.275119 0.282753 0.278273 0.272448 0.250948 0.275304 0.283086 0.278451 0.273413
charge: -0.180741 0.932436 -0.239393 -0.089788 -0.111696 -0.055286 -0.109444 -0.077876 -0.239661 -0.088807 -0.111905 -0.054551 -0.109611 -0.077194 0.151197 0.162903 0.165215 0.164415 0.162609 0.151442 0.162979 0.165301 0.164474 0.162980
qa: -0.4105 1.2930 -0.2082 -0.2495 -0.1927 -0.2009 -0.1966 -0.2536 -0.2092 -0.2485 -0.1927 -0.2006 -0.1964 -0.2535 0.2502 0.2751 0.2828 0.2783 0.2724 0.2509 0.2753 0.2831 0.2785 0.2734
va: 1.0613 3.3477 3.6667 3.7972 3.7947 3.7699 3.7842 3.8061 3.6684 3.7949 3.7941 3.7692 3.7830 3.8044 0.9024 0.8901 0.8864 0.8889 0.8945 0.9021 0.8901 0.8863 0.8889 0.8943
dispersion: -0.016254624 hartree
energy: -850.858359638457 hartree
dipole: 0.09959 -0.10366 -0.00407 8.08918 -7.56846 0.52072 -1.91958 1.79942 -0.12016
magnitude: 0.53442 au
magnitude: 1.35838 debye
temp: 298.15 k
press: 1.00 atm
zeropoint: 0.19182292 hartree
thermalvibcorrection: 0.00896510 hartree
thermalrotcorrection: 0.00141627 hartree
thermaltrasncorrection: 0.00141627 hartree
thermaltotal: -850.65473908 hartree
thermalcorr: 0.01179764 hartree
nonthermalcorr: 0.19182292 hartree
totalcorr: 0.20362056 hartree
thermalcorrenthalpy: 0.00094421 hartree
totalenthalpy: -850.65379487 hartree
vibrat: 0.01560644 hartree
rotat: 0.01526505 hartree
transl: 0.01986207 hartree
total: 0.05073357 hartree
totalentropycorr: -0.05073357 hartree
gibbsenthalpy: -850.70452843 hartree
gibbsminuselec: 0.15383120 hartree
