program: Orca
programVersion: 5.0.4
elementType: O Si C C C C C C C C C C C C H H H H H H H H H H
charge: 0
multiplicity: 1
keywords: Opt RIJCOSX PBEh-3c
formula: C12H10OSi
InChI: InChI=1/C12H10OSi/c13-14(11-7-3-1-4-8-11)12-9-5-2-6-10-12/h1-10H
24 atoms
O  -0.270855 1.08519 3.039551
Si -0.139523 0.546698 1.618828
C  1.506807 0.231941 0.837609
C  1.706779 -0.647546 -0.229763
C  2.977321 -0.866522 -0.73864
C  4.065998 -0.206216 -0.187401
C  3.886923 0.660989 0.881379
C  2.618233 0.872085 1.395881
C  -1.610745 0.169824 0.565478
C  -1.579013 0.155031 -0.83161
C  -2.729211 -0.095198 -1.563262
C  -3.926773 -0.33857 -0.906613
C  -3.978387 -0.315412 0.480212
C  -2.831162 -0.053727 1.210813
H  0.870614 -1.185303 -0.659397
H  3.119243 -1.554926 -1.561239
H  5.057885 -0.374322 -0.586379
H  4.738166 1.166896 1.317257
H  2.485025 1.534043 2.242562
H  -0.656634 0.360299 -1.36109
H  -2.692359 -0.096953 -2.644596
H  -4.824094 -0.538923 -1.477513
H  -4.915162 -0.494347 0.991025
H  -2.879278 -0.01503 2.292007
totalener: -826.50106999 hartree
nucrepener: 863.91380198 hartree
electener: -1690.41487197 hartree
oneelecener: -2844.26259399 hartree
twoeener: 1153.84772202 hartree
kineticenergy: 821.73736606 hartree
exchangeener: -52.714945771587 hartree
correlationener: -4.625921951622 hartree
xcener: -57.340867723209 hartree
dispersion: -0.016764373 hartree
energy: -1816.7656 -528.6727 -284.9271 -284.9189 -284.8400 -284.8353 -284.7997 -284.7899 -284.7207 -284.7152 -284.6695 -284.6624 -284.6577 -284.6506 -150.6405 -104.2803 -104.0890 -104.0694 -27.1428 -26.4553 -26.4252 -23.3566 -23.2438 -23.2323 -23.0993 -19.0931 -19.0371 -18.9063 -18.7264 -16.7869 -16.3164 -14.9232 -14.4916 -14.4052 -14.3392 -13.9411 -13.5806 -13.4864 -12.8607 -12.0730 -12.0062 -11.7655 -11.3039 -11.1938 -10.3520 -10.1915 -9.5546 -8.5740 -8.5149 -8.4596 -8.4482 -8.2798 -1.3917 -0.2504 0.0438 0.1205 1.4403 1.7751 3.4772 3.8216 4.0502 4.6999 4.8977 5.0767 5.2740 5.5132 5.5985 5.9781 6.4412 6.5114 6.6605 7.1525 7.1773 7.9548 8.4292 8.4824 8.6955 8.7000 8.7940 9.3160 9.4484 11.9862 12.1846 12.6675 13.7379 13.8642 14.0907 14.3123 14.4782 14.7080 15.6778 15.6984 15.7504 16.0309 16.3032 16.4589 16.4607 16.5334 16.6343 16.6766 16.8244 16.9246 16.9412 17.0395 17.8536 18.1347 18.3893 18.6266 18.6524 19.4101 19.4780 20.1871 20.5334 20.7351 21.2529 21.4601 21.8242 23.6066 23.6963 25.1426 25.4080 25.5406 25.7443 26.0299 26.0345 26.2494 26.5477 26.7885 27.2060 27.4190 28.1528 28.2691 28.2773 28.5161 28.9397 29.3099 29.5050 30.0745 30.1169 30.5007 30.9611 31.3267 32.0035 32.6722 33.1890 34.5969 34.6555 35.1679 35.5424 35.5865 35.7499 35.8851 36.4239 36.5787 39.5040 39.8229 41.4694 41.4796 41.6795 41.6900 42.1135 42.2223 42.5957 42.8972 43.7514 44.4933 49.3101 49.3776 49.6632 50.7426 50.9622 51.8093 52.8155 53.1733 54.7363 54.9465 55.2275 55.9082 56.0927 57.7619 57.8288 58.4249 58.4377 58.5161 59.3385 59.5518 59.6101 59.6563 59.7740 59.9803 60.1560 60.3217 62.1646 64.0150 64.2132 64.3166 64.3596 64.5451 64.6024 69.5622 69.9314 70.9826 71.7021 73.4939 73.9619 74.1595 74.5172 74.5994 74.8320 75.3357 75.6516 75.9294 76.1730 76.9302 77.1049 77.8596 83.2365 83.8723 93.3706 93.6237 360.3848 360.7464 370.9783 371.1335 371.7789 372.4476 383.6366 383.7783 384.1823 384.3490 395.3835 395.5416 696.5413 electronvolt
chargesum: -0.0000000
charge: -0.597774 0.959277 -0.207615 -0.277629 -0.199852 -0.225195 -0.202661 -0.256136 -0.206025 -0.278354 -0.199636 -0.225524 -0.202366 -0.256216 0.239021 0.227306 0.231087 0.230154 0.260902 0.239082 0.227223 0.231180 0.230038 0.259713
charge: -0.434505 0.629748 -0.218250 -0.119598 -0.136344 -0.110938 -0.132755 -0.097965 -0.217791 -0.119838 -0.136122 -0.111036 -0.132490 -0.098320 0.140972 0.139755 0.140484 0.141413 0.155647 0.140984 0.139801 0.140546 0.141440 0.155160
qa: -0.5978 0.9593 -0.2076 -0.2776 -0.1999 -0.2252 -0.2027 -0.2561 -0.2060 -0.2784 -0.1996 -0.2255 -0.2024 -0.2562 0.2390 0.2273 0.2311 0.2302 0.2609 0.2391 0.2272 0.2312 0.2300 0.2597
va: 2.1458 3.9365 3.6553 3.8083 3.8109 3.8184 3.7918 3.8211 3.6547 3.8100 3.8116 3.8182 3.7924 3.8227 0.9046 0.9088 0.9072 0.9077 0.9015 0.9045 0.9088 0.9072 0.9078 0.9015
dispersion: -0.016764142 hartree
energy: -826.487669421258 hartree
dipole: 0.60245 -0.43860 0.16385 -2.37843 1.69718 -0.68125 -6.28536 4.49672 -1.78864
magnitude: 1.92099 au
magnitude: 4.88276 debye
