program: Orca
programVersion: 5.0.4
elementType: C Si C C C C C C C C C C C H H H H H H H H H H
charge: 2
multiplicity: 1
keywords: Opt RIJCOSX PBEh-3c
formula: C12H10Si
InChI: InChI=1/C12H10Si/c1-3-7-11(8-4-1)13-12-9-5-2-6-10-12/h1-10H
23 atoms
C  1.743899 -0.010851 0.005383
Si -0.000073 0.003646 -0.086921
C  -1.744123 0.015988 -0.177643
C  -2.418412 -1.087145 -0.776409
C  -3.789021 -1.059036 -0.841616
C  -4.49026 0.036845 -0.328895
C  -3.832901 1.122096 0.259204
C  -2.463125 1.129771 0.344286
C  2.377538 -0.584601 1.145192
C  3.749022 -0.590439 1.197595
C  4.490446 -0.041626 0.146561
C  3.873018 0.523667 -0.973596
C  2.503712 0.547906 -1.062495
H  -1.879319 -1.937434 -1.175804
H  -4.323695 -1.885253 -1.290017
H  -5.571427 0.045168 -0.388626
H  -4.401083 1.956465 0.647232
H  -1.958216 1.972163 0.800904
H  1.807381 -1.010235 1.96184
H  4.253363 -1.019889 2.052446
H  5.571815 -0.054325 0.201831
H  4.471779 0.941471 -1.771393
H  2.029782 0.985649 -1.932459
totalener: -750.65002694 hartree
nucrepener: 728.53891960 hartree
electener: -1479.18894654 hartree
oneelecener: -2438.84887260 hartree
twoeener: 959.65992605 hartree
kineticenergy: 746.50975579 hartree
exchangeener: -47.745107496778 hartree
correlationener: -4.160073098757 hartree
xcener: -51.905180595535 hartree
dispersion: -0.015094361 hartree
energy: -1828.3331 -294.2644 -294.2624 -293.4442 -293.4433 -293.4430 -293.4424 -292.9402 -292.9397 -292.4169 -292.4169 -292.4165 -292.4159 -162.1945 -115.7554 -115.7547 -115.4944 -34.7747 -34.6850 -31.7294 -31.4468 -31.4467 -31.3976 -27.7635 -27.1078 -27.0283 -27.0280 -25.1815 -24.4765 -23.2087 -22.7014 -22.7010 -22.3839 -21.7057 -21.6469 -21.6467 -21.1249 -20.2353 -20.2340 -19.4367 -19.1866 -19.1864 -18.8839 -16.9732 -16.9698 -16.4389 -16.4268 -11.5070 -11.5057 -9.9991 -7.9694 -7.9610 -7.6414 -7.5651 -3.3986 -3.2211 -3.2203 -3.1295 -2.6878 -2.3445 -2.3430 -2.0548 -1.7459 -1.7113 -1.2311 -0.9821 -0.9701 -0.2770 -0.0942 -0.0937 0.1388 1.2137 1.2255 1.2801 1.2814 2.0058 2.5649 3.1504 3.1592 3.9962 3.9999 4.7140 6.2919 6.3158 6.3183 6.6578 7.6924 7.7757 7.7815 7.9346 8.1380 8.2493 8.2999 8.7411 8.7440 8.9230 8.9238 9.3724 9.4328 9.6257 9.6272 10.0420 10.0454 10.4665 11.0667 11.3389 11.3425 12.4841 12.4854 12.5441 13.6774 13.9000 14.3449 14.3596 16.8483 17.6416 18.0718 18.0724 18.6124 18.6182 18.6479 18.9046 19.1686 19.1699 20.2267 20.2287 20.2670 20.3817 20.8088 20.9857 21.8024 22.0242 22.2909 22.2950 23.5758 23.8367 24.2600 24.5891 25.6496 25.6516 26.7236 26.8511 27.7367 27.8433 27.8633 27.8641 31.6589 31.6597 32.7746 32.8462 33.7039 33.7042 34.0350 34.0355 34.6808 34.7803 36.5343 36.5512 40.9654 41.2799 41.2860 41.4374 43.4357 44.0349 47.2931 47.2949 47.4191 48.0270 49.0701 49.0716 49.8984 49.9582 50.8697 50.8721 50.8759 50.9334 51.8593 51.8739 51.8896 51.8910 55.0984 55.2359 55.5457 55.5485 56.6553 56.6558 60.8797 61.6272 63.1352 63.1378 65.3727 65.4364 65.5367 65.7226 65.7275 66.0515 67.1998 67.3300 67.6470 67.6496 68.7382 69.2690 74.7515 74.7530 84.6040 84.6766 351.7119 354.2144 362.3871 362.3893 362.9692 366.0432 374.0919 374.4611 376.2040 376.2050 386.5951 386.6532 electronvolt
chargesum: 2.0000000
charge: -0.210607 1.167536 -0.210610 -0.217477 -0.192781 -0.158066 -0.192570 -0.217247 -0.217330 -0.192781 -0.158114 -0.192547 -0.217423 0.301927 0.330775 0.339597 0.330694 0.302026 0.301984 0.330771 0.339611 0.330687 0.301945
charge: -0.238013 1.106876 -0.238014 -0.050222 -0.085232 0.022637 -0.085158 -0.050149 -0.050171 -0.085207 0.022601 -0.085171 -0.050222 0.178536 0.191119 0.193382 0.191100 0.178587 0.178578 0.191122 0.193383 0.191091 0.178546
qa: -0.2106 1.1675 -0.2106 -0.2175 -0.1928 -0.1581 -0.1926 -0.2172 -0.2173 -0.1928 -0.1581 -0.1925 -0.2174 0.3019 0.3308 0.3396 0.3307 0.3020 0.3020 0.3308 0.3396 0.3307 0.3019
va: 3.6668 2.9590 3.6669 3.7570 3.7607 3.6746 3.7603 3.7568 3.7568 3.7607 3.6746 3.7604 3.7570 0.8774 0.8635 0.8573 0.8635 0.8774 0.8774 0.8635 0.8573 0.8635 0.8774
dispersion: -0.015094313 hartree
energy: -750.637179155769 hartree
dipole: 0.00057 -0.00070 -0.00013 -0.01254 0.01296 0.00042 -0.01011 0.00787 -0.00225
magnitude: 0.00229 au
magnitude: 0.00582 debye
