program: Orca
programVersion: 5.0.4
elementType: C Si C C C C C C C C C C C H H H H H H H H H H
charge: 2
multiplicity: 1
keywords: SP DSD-BLYP D3BJ def2-QZVPP def2-QZVPP/C def2/J TightSCF
formula: C12H10Si
InChI: InChI=1/C12H10Si/c1-3-7-11(8-4-1)13-12-9-5-2-6-10-12/h1-10H
23 atoms
C  1.743921 -0.011548 0.093718
Si -0.00005 0.002949 0.001415
C  -1.7441 0.015291 -0.089308
C  -2.418389 -1.087842 -0.688074
C  -3.788998 -1.059733 -0.753281
C  -4.490237 0.036148 -0.24056
C  -3.832878 1.121399 0.347539
C  -2.463103 1.129074 0.432621
C  2.377561 -0.585298 1.233527
C  3.749044 -0.591136 1.28593
C  4.490468 -0.042323 0.234896
C  3.873041 0.52297 -0.88526
C  2.503735 0.547209 -0.974159
H  -1.879296 -1.938131 -1.087468
H  -4.323672 -1.88595 -1.201681
H  -5.571404 0.044471 -0.300291
H  -4.40106 1.955768 0.735567
H  -1.958194 1.971466 0.889239
H  1.807404 -1.010932 2.050175
H  4.253386 -1.020586 2.140782
H  5.571838 -0.055021 0.290166
H  4.471802 0.940774 -1.683058
H  2.029804 0.984952 -1.844123
totalener: -750.45152816 hartree
nucrepener: 728.53576661 hartree
electener: -1478.98729477 hartree
oneelecener: -2439.44016832 hartree
twoeener: 960.45287355 hartree
kineticenergy: 748.92810170 hartree
exchangeener: -26.597158521801 hartree
correlationener: -1.754267488902 hartree
xcener: -28.351426010702 hartree
chargesum: 2.0000000
charge: -0.019004 0.993833 -0.018376 -0.039651 -0.081362 0.031777 -0.077727 -0.042598 -0.041114 -0.079386 0.032364 -0.078774 -0.041901 0.124283 0.155836 0.170683 0.154872 0.125588 0.124585 0.155115 0.170618 0.154838 0.125499
charge: -0.165137 1.011689 -0.165124 0.135314 0.145048 0.214296 0.145132 0.135367 0.135366 0.145122 0.214252 0.145048 0.135294 -0.026456 -0.024467 -0.013982 -0.024483 -0.026461 -0.026440 -0.024477 -0.013967 -0.024475 -0.026459
qa: -0.0190 0.9938 -0.0184 -0.0397 -0.0814 0.0318 -0.0777 -0.0426 -0.0411 -0.0794 0.0324 -0.0788 -0.0419 0.1243 0.1558 0.1707 0.1549 0.1256 0.1246 0.1551 0.1706 0.1548 0.1255
va: 3.6254 3.2914 3.6262 3.8040 3.8481 3.7763 3.8488 3.8040 3.8055 3.8494 3.7773 3.8470 3.8046 0.9784 0.9762 0.9616 0.9764 0.9781 0.9784 0.9763 0.9616 0.9766 0.9781
total: -751.469826117 hartree
dispersion: -0.021808801 hartree
energy: -751.491634918271 hartree
dipole: 0.00057 -0.00075 -0.00018 -0.01254 0.01335 0.00081 -0.01011 0.00839 -0.00172
magnitude: 0.00191 au
magnitude: 0.00485 debye
