program: Orca
programVersion: 5.0.4
elementType: Si F F H
charge: 1
multiplicity: 1
keywords: SP DSD-BLYP D3BJ def2-QZVPP def2-QZVPP/C def2/J TightSCF
formula: HF2Si
InChI: InChI=1/F2HSi/c1-3-2/h3H
4 atoms
Si -0.034163 0.425129 -0.001949
F  1.354508 -0.257371 0.04757
F  -1.296027 -0.470723 -0.044379
H  -0.150387 1.87775 -0.005828
totalener: -489.00245835 hartree
nucrepener: 110.97767393 hartree
electener: -599.98013228 hartree
oneelecener: -891.65801378 hartree
twoeener: 291.67788151 hartree
kineticenergy: 488.21952229 hartree
exchangeener: -12.646640091830 hartree
correlationener: -0.674519014505 hartree
xcener: -13.321159106335 hartree
energy: -1855.3333 -707.0005 -707.0001 -169.0613 -120.3852 -120.1601 -120.0835 -47.7594 -47.3153 -27.2452 -25.3160 -24.6862 -24.2605 -23.6180 -23.4351 -22.0495 -7.3350 -6.3432 -4.1572 -2.3010 -1.5221 -1.0418 -0.2738 0.2441 0.9398 1.2827 1.7144 2.7024 3.0644 5.0635 7.3948 7.4967 7.5083 8.0793 8.4392 10.0581 10.4276 11.1330 11.4579 11.7920 12.5969 12.8509 13.2353 14.3627 14.4725 15.5272 15.5492 16.7791 16.8533 18.8490 19.6883 22.2672 24.5872 26.0005 26.6189 27.7186 27.7315 29.7219 33.3968 37.1444 38.7553 38.8677 39.1413 40.4785 41.0356 42.0017 42.6624 43.1137 43.8090 44.3884 45.1267 45.5142 45.9555 46.1106 46.3881 47.3381 49.4171 50.7419 50.7934 51.4405 52.9528 54.0196 54.3261 54.7914 54.8327 55.3543 57.8067 58.7637 61.1406 64.6728 65.6805 66.6039 67.0114 67.5498 73.3611 73.3639 73.6891 76.4464 77.4065 80.9334 81.1083 84.4851 85.8520 87.4428 96.9404 97.3515 107.3616 112.0385 112.9600 113.7259 114.6826 116.6757 116.8153 120.8299 122.3076 122.7815 125.5417 126.1028 127.2384 128.7736 129.6677 137.3349 138.5352 139.8177 140.0543 142.9649 145.1914 145.5932 148.0248 150.7653 152.6096 153.8973 154.2443 154.8783 157.0651 160.3020 161.3602 163.0538 166.3021 166.8585 173.4855 174.7155 175.1228 176.7238 176.7362 179.0662 179.2039 184.3305 193.4793 197.0108 198.9580 202.3006 210.2874 215.5490 217.3446 219.3077 230.3763 234.4081 238.8702 251.4574 303.6184 307.2716 311.0017 311.0087 311.1523 311.3427 311.3531 311.3988 311.4462 311.4489 312.1725 312.2357 312.9909 313.7888 314.0518 314.2039 314.9810 315.4368 315.8050 345.7683 347.1923 399.1860 399.5111 399.7960 400.2680 401.8013 404.1495 406.1625 406.6811 407.9325 410.6175 411.4643 411.9514 417.0856 418.0717 431.3392 434.6055 434.6783 435.4029 435.7787 437.8879 444.2461 445.1033 446.6340 447.2094 450.5247 455.6887 463.7617 1493.4013 1494.1902 1591.3692 7810.2894 7810.5498 8652.4115 electronvolt
chargesum: 1.0000000
charge: 1.338597 -0.226359 -0.226684 0.114447
charge: 0.311456 0.377337 0.377345 -0.066139
qa: 1.3386 -0.2264 -0.2267 0.1144
va: 3.4685 1.2724 1.2722 0.9835
total: -489.318679758 hartree
dispersion: -0.001399793 hartree
energy: -489.320079550529 hartree
dipole: -0.19333 0.07872 -0.11461 2.41206 -0.98723 1.42483 -0.00831 0.00118 -0.00714
magnitude: 1.42945 au
magnitude: 3.63338 debye
