program: Orca
programVersion: 5.0.4
elementType: Si F O H
charge: 0
multiplicity: 1
keywords: Freq RIJCOSX PBEh-3c
frequency: 0.00 0.00 0.00 0.00 0.00 0.00 368.41 600.91 891.87 924.38 1332.38 2389.24
frequency: 368.41 600.91 891.87 924.38 1332.38 2389.24
formula: HFOSi
InChI: InChI=1/FHOSi/c1-3-2/h3H
4 atoms
Si -0.069056 -0.057323 0.000181
F  1.51765 0.089062 -0.002749
O  -0.852886 -1.348078 0.003963
H  -0.595708 1.316338 -0.001294
totalener: -464.50527786 hartree
nucrepener: 103.40147157 hartree
electener: -567.90674943 hartree
oneelecener: -850.36783873 hartree
twoeener: 282.46108930 hartree
kineticenergy: 462.85862728 hartree
exchangeener: -21.884982538803 hartree
correlationener: -1.532269965271 hartree
xcener: -23.417252504074 hartree
energy: -1818.5783 -683.8202 -529.8054 -152.4390 -106.0800 -105.9269 -105.8233 -36.6450 -28.2502 -17.4146 -15.1644 -14.8918 -13.8119 -11.4212 -10.2288 -9.8886 -0.7342 0.1399 3.2260 5.2496 6.0689 10.9597 11.4674 12.8275 13.2374 15.4464 15.9509 20.1367 23.1821 28.5775 29.7899 30.7286 32.4261 33.1993 33.6091 33.7947 34.1678 36.3534 40.6309 41.4691 43.1924 50.3312 52.0928 52.5188 58.2073 62.4275 74.9372 79.9794 692.9738 890.9447 electronvolt
chargesum: 0.0000000
charge: 1.033482 -0.455752 -0.570453 -0.007277
charge: 0.616472 -0.221324 -0.392864 -0.002284
qa: 1.0335 -0.4558 -0.5705 -0.0073
va: 3.9466 0.9912 2.1622 0.9742
dispersion: -0.000874652 hartree
energy: -464.500633193560 hartree
dipole: -1.96769 2.22147 0.25377 1.12617 0.09134 1.21751 0.00139 -0.00421 -0.00282
magnitude: 1.24368 au
magnitude: 3.16117 debye
temp: 298.15 k
press: 1.00 atm
zeropoint: 0.01482448 hartree
thermalvibcorrection: 0.00061571 hartree
thermalrotcorrection: 0.00141627 hartree
thermaltrasncorrection: 0.00141627 hartree
thermaltotal: -464.48236047 hartree
thermalcorr: 0.00344825 hartree
nonthermalcorr: 0.01482448 hartree
totalcorr: 0.01827273 hartree
thermalcorrenthalpy: 0.00094421 hartree
totalenthalpy: -464.48141626 hartree
vibrat: 0.00087082 hartree
rotat: 0.01068102 hartree
transl: 0.01824119 hartree
total: 0.02979303 hartree
totalentropycorr: -0.02979303 hartree
gibbsenthalpy: -464.51120929 hartree
gibbsminuselec: -0.01057609 hartree
