program: Orca
programVersion: 5.0.4
elementType: Si F O H
charge: 0
multiplicity: 1
keywords: Opt RIJCOSX PBEh-3c
formula: HFOSi
InChI: InChI=1/FHOSi/c1-3-2/h3H
4 atoms
Si -0.069056 -0.057323 0.000181
F  1.51765 0.089062 -0.002749
O  -0.852886 -1.348078 0.003963
H  -0.595708 1.316338 -0.001294
totalener: -464.50527758 hartree
nucrepener: 103.39965320 hartree
electener: -567.90493078 hartree
oneelecener: -850.36329008 hartree
twoeener: 282.45835931 hartree
kineticenergy: 462.85729262 hartree
exchangeener: -21.884867638309 hartree
correlationener: -1.532265002554 hartree
xcener: -23.417132640863 hartree
dispersion: -0.000874650 hartree
energy: -1818.5770 -683.8233 -529.8108 -152.4380 -106.0790 -105.9258 -105.8223 -36.6459 -28.2522 -17.4152 -15.1650 -14.8927 -13.8124 -11.4228 -10.2304 -9.8904 -0.7344 0.1398 3.2258 5.2497 6.0688 10.9600 11.4675 12.8278 13.2374 15.4464 15.9511 20.1368 23.1815 28.5770 29.7882 30.7271 32.4253 33.1989 33.6085 33.7941 34.1672 36.3530 40.6306 41.4685 43.1919 50.3295 52.0911 52.5172 58.2057 62.4261 74.9356 79.9788 692.9691 890.9420 electronvolt
chargesum: -0.0000000
charge: 1.033271 -0.455699 -0.570280 -0.007291
charge: 0.616292 -0.221280 -0.392717 -0.002296
qa: 1.0333 -0.4557 -0.5703 -0.0073
va: 3.9469 0.9913 2.1623 0.9742
dispersion: -0.000874652 hartree
energy: -464.500633238973 hartree
dipole: -1.96769 2.22140 0.25371 1.12617 0.09098 1.21714 0.00139 -0.00421 -0.00282
magnitude: 1.24331 au
magnitude: 3.16024 debye
