program: Orca
programVersion: 5.0.4
elementType: F Si F F F
charge: 0
multiplicity: 1
keywords: Freq RIJCOSX PBEh-3c
frequency: 0.00 0.00 0.00 0.00 0.00 0.00 245.70 251.81 373.49 375.82 376.91 795.76 1043.50 1048.47 1049.85
frequency: 245.70 251.81 373.49 375.82 376.91 795.76 1043.50 1048.47 1049.85
formula: F4Si
InChI: InChI=1/F4Si/c1-5(2,3)4
5 atoms
F  -1.17546 -0.740879 -0.767582
Si -0.002839 0.000783 -0.001729
F  0.502995 -0.908073 1.190402
F  -0.532362 1.381659 0.565772
F  1.207665 0.26651 -0.986863
totalener: -688.03290122 hartree
nucrepener: 267.87965810 hartree
electener: -955.91255933 hartree
oneelecener: -1491.52007389 hartree
twoeener: 535.60751456 hartree
kineticenergy: 684.81451637 hartree
exchangeener: -34.080410645587 hartree
correlationener: -2.423663500364 hartree
xcener: -36.504074145951 hartree
energy: -1821.3555 -683.9479 -683.9432 -683.9312 -683.9195 -154.6347 -108.2092 -108.2072 -108.2063 -37.5581 -36.5961 -36.5918 -36.5780 -18.8111 -16.7690 -16.7637 -16.7492 -15.2098 -15.1899 -14.9119 -14.9071 -14.9006 -14.0236 -14.0184 -14.0083 1.2591 3.8942 3.9689 3.9988 7.5947 11.4083 11.4321 11.4430 14.8319 14.8743 20.8438 20.8549 20.8789 31.0504 31.0828 31.1404 31.8592 31.8953 32.2365 32.7644 32.8219 32.8506 32.9695 32.9814 32.9895 33.2455 33.2558 33.2848 33.6432 33.7012 36.6084 36.6708 36.7900 38.3912 38.4636 38.6737 42.7235 42.8461 42.8932 46.6181 47.8529 47.9393 48.1476 53.2776 53.2798 80.2020 80.3273 80.3725 80.7650 891.0392 892.5705 892.6744 892.7315 electronvolt
chargesum: -0.0000000
charge: -0.441971 1.769828 -0.443002 -0.442236 -0.442619
charge: -0.198679 0.793667 -0.198122 -0.198502 -0.198364
qa: -0.4420 1.7698 -0.4430 -0.4422 -0.4426
va: 0.9921 3.7798 0.9906 0.9918 0.9912
dispersion: -0.001173510 hartree
energy: -688.016387516251 hartree
dipole: -0.00340 -0.00817 -0.01157 0.00094 0.00243 0.00337 -0.00207 -0.00499 -0.00706
magnitude: 0.01397 au
magnitude: 0.03551 debye
temp: 298.15 k
press: 1.00 atm
zeropoint: 0.01266958 hartree
thermalvibcorrection: 0.00215045 hartree
thermalrotcorrection: 0.00141627 hartree
thermaltrasncorrection: 0.00141627 hartree
thermaltotal: -687.99873494 hartree
thermalcorr: 0.00498300 hartree
nonthermalcorr: 0.01266958 hartree
totalcorr: 0.01765257 hartree
thermalcorrenthalpy: 0.00094421 hartree
totalenthalpy: -687.99779073 hartree
vibrat: 0.00337967 hartree
rotat: 0.01237121 hartree
transl: 0.01892785 hartree
total: 0.03467873 hartree
totalentropycorr: -0.03467873 hartree
gibbsenthalpy: -688.03246946 hartree
gibbsminuselec: -0.01608194 hartree
