program: Orca
programVersion: 5.0.4
elementType: F Si F O
charge: 0
multiplicity: 1
keywords: SP DSD-BLYP D3BJ def2-QZVPP def2-QZVPP/C def2/J TightSCF
formula: F2OSi
InChI: InChI=1/F2OSi/c1-4(2)3
4 atoms
F  1.357287 -0.622908 0.025135
Si -0.021784 0.153578 0.001463
F  -1.119938 -0.986199 -0.026069
O  -0.243599 1.641132 -0.001459
totalener: -563.83877470 hartree
nucrepener: 168.26507680 hartree
electener: -732.10385150 hartree
oneelecener: -1118.21349888 hartree
twoeener: 386.10964738 hartree
kineticenergy: 562.89519730 hartree
exchangeener: -15.204188900689 hartree
correlationener: -0.839613241356 hartree
xcener: -16.043802142045 hartree
energy: -1847.2400 -700.4488 -700.4392 -544.2693 -161.0609 -112.3857 -112.2083 -112.0842 -41.2512 -40.6810 -31.5956 -20.4449 -18.8275 -18.0493 -17.9856 -17.2381 -16.8698 -13.8337 -12.0181 -11.9395 -0.4232 0.8384 2.7311 2.9495 3.9927 5.2631 6.8378 7.2913 7.4611 8.0636 8.1660 8.5775 9.1287 11.1297 11.4515 12.0927 12.4639 13.0751 13.4269 13.9469 14.7540 16.1178 18.0528 18.8754 18.9027 19.5632 19.6103 19.8569 20.7906 21.3192 21.6623 22.9880 23.0808 23.3772 27.5613 27.9480 29.1986 31.3760 33.0326 33.7861 34.2445 36.4782 39.9817 41.3932 41.5275 42.1933 42.4627 43.8340 45.8585 45.9566 46.4472 47.1491 47.7751 48.3320 49.2595 49.9490 50.0071 50.4844 51.4322 51.6886 52.1831 52.3348 52.7046 56.0905 56.8386 57.0141 58.1745 59.6894 59.9985 60.0950 60.5325 61.5204 62.6962 64.0230 64.6880 67.0308 70.3485 71.7086 76.5028 76.8019 76.8782 78.8723 79.0373 79.7485 84.4617 85.4487 86.9764 95.3393 95.5844 96.9070 98.8590 105.2194 108.7817 109.9640 113.7753 114.2944 115.0164 116.4699 118.5699 118.6762 119.3408 120.1311 120.7154 121.7956 125.8686 126.0392 126.9900 127.3256 127.5068 129.0873 131.2423 132.3461 134.2507 137.9064 138.2978 140.4740 141.3282 145.0487 145.5751 145.9211 146.9832 149.5974 149.9258 151.8307 154.4583 156.2451 156.3228 158.8067 159.0473 159.7891 167.8223 168.3289 169.1186 169.4847 180.2780 180.4039 184.4521 188.2466 195.2371 199.5009 205.7632 205.9354 211.9709 249.8732 249.8835 251.0218 251.1890 253.6732 253.7192 256.2581 257.5030 258.5235 308.4359 308.6836 313.2154 314.2356 315.1101 315.2918 317.2070 317.3050 317.4419 317.5848 317.6608 317.6753 317.6855 317.9048 318.1083 318.4919 319.1632 319.6845 320.6290 320.9006 321.0313 322.2253 323.0061 326.4810 328.7411 334.3972 338.2590 339.3848 344.6260 346.0017 351.5785 354.1906 366.0633 384.1688 405.4952 405.8309 405.9517 406.5786 409.8337 410.0019 411.2754 412.1957 415.4525 417.0005 417.0720 418.8065 419.3961 427.1602 434.9761 439.9713 440.2613 441.5689 442.8750 443.8347 450.6800 450.7000 451.1395 455.8785 458.2075 461.8367 472.3805 1322.5273 1497.6551 1501.0757 1601.6717 6930.5835 7814.0381 7817.2085 8664.2935 electronvolt
chargesum: 0.0000000
charge: -0.362400 1.282776 -0.363926 -0.556450
charge: 0.283727 -0.613013 0.283399 0.045887
qa: -0.3624 1.2828 -0.3639 -0.5564
va: 1.0640 4.2723 1.0618 2.1643
total: -564.288307197 hartree
dispersion: -0.001835846 hartree
energy: -564.290143043063 hartree
dipole: -0.22227 0.37206 0.14979 1.50642 -2.48699 -0.98057 0.00076 0.00610 0.00686
magnitude: 0.99197 au
magnitude: 2.52138 debye
