program: Orca
programVersion: 5.0.4
elementType: F Si F F C H H H
charge: 0
multiplicity: 1
keywords: Freq RIJCOSX PBEh-3c
frequency: 0.00 0.00 0.00 0.00 0.00 0.00 143.52 216.25 220.16 318.29 321.42 380.97 701.94 833.97 835.08 914.55 1014.81 1016.45 1388.53 1513.23 1513.32 3131.24 3219.74 3224.55
frequency: 143.52 216.25 220.16 318.29 321.42 380.97 701.94 833.97 835.08 914.55 1014.81 1016.45 1388.53 1513.23 1513.32 3131.24 3219.74 3224.55
formula: CH3F3Si
InChI: InChI=1/CH3F3Si/c1-5(2,3)4/h1H3
8 atoms
F  1.462032 -0.524476 1.351214
Si 0.848779 -0.014639 -0.034276
F  1.39847 -0.986288 -1.177878
F  1.441047 1.444037 -0.314407
C  -0.991263 0.014262 0.029134
H  -1.424812 0.374342 -0.903258
H  -1.336614 0.671023 0.827623
H  -1.397639 -0.97826 0.221847
totalener: -628.15641715 hartree
nucrepener: 260.94710537 hartree
electener: -889.10352252 hartree
oneelecener: -1391.96892240 hartree
twoeener: 502.86539988 hartree
kineticenergy: 625.25217227 hartree
exchangeener: -31.890944933446 hartree
correlationener: -2.366757791219 hartree
xcener: -34.257702724665 hartree
energy: -1819.6640 -683.1094 -683.0947 -683.0875 -284.3907 -153.0943 -106.6803 -106.6793 -106.5661 -36.4552 -35.7187 -35.7051 -22.2063 -17.6863 -15.7969 -15.7884 -15.0513 -14.2988 -14.2884 -13.8234 -13.8154 -13.2173 -13.0098 -13.0082 -11.4918 2.2691 3.0933 3.1257 4.2508 5.4297 5.4550 6.3593 8.3224 12.1689 12.2728 12.2897 13.5429 13.9598 13.9783 17.3004 17.3947 21.6593 21.6710 22.9075 27.0177 27.0277 28.5257 31.2194 32.1482 32.1836 32.5065 33.3972 33.4676 33.5082 33.6452 33.8656 33.8808 34.2101 34.2535 35.7121 36.6414 36.6675 38.9497 39.5202 39.5714 39.6909 43.6576 43.7160 47.5717 48.1889 48.2822 49.9016 51.6695 51.8455 59.8216 64.0742 64.1686 80.0450 80.0964 80.9924 372.5968 891.5288 892.8143 892.8559 electronvolt
chargesum: 0.0000000
charge: -0.456550 1.567674 -0.456134 -0.456411 -0.990919 0.264400 0.263906 0.264033
charge: -0.226019 0.748478 -0.225109 -0.225976 -0.563804 0.163846 0.164584 0.164000
qa: -0.4565 1.5677 -0.4561 -0.4564 -0.9909 0.2644 0.2639 0.2640
va: 0.9688 3.7752 0.9701 0.9692 3.6965 0.8959 0.8957 0.8958
dispersion: -0.002437993 hartree
energy: -628.144063038764 hartree
dipole: -7.91613 7.00634 -0.90979 0.12530 -0.11253 0.01277 0.26914 -0.24883 0.02030
magnitude: 0.91010 au
magnitude: 2.31330 debye
temp: 298.15 k
press: 1.00 atm
zeropoint: 0.04763198 hartree
thermalvibcorrection: 0.00322797 hartree
thermalrotcorrection: 0.00141627 hartree
thermaltrasncorrection: 0.00141627 hartree
thermaltotal: -628.09037055 hartree
thermalcorr: 0.00606051 hartree
nonthermalcorr: 0.04763198 hartree
totalcorr: 0.05369249 hartree
thermalcorrenthalpy: 0.00094421 hartree
totalenthalpy: -628.08942634 hartree
vibrat: 0.00539074 hartree
rotat: 0.01246974 hartree
transl: 0.01887287 hartree
total: 0.03673335 hartree
totalentropycorr: -0.03673335 hartree
gibbsenthalpy: -628.12615969 hartree
gibbsminuselec: 0.01790335 hartree
