program: Orca
programVersion: 5.0.4
elementType: F Si C H H H
charge: 2
multiplicity: 1
keywords: Freq RIJCOSX PBEh-3c
frequency: 0.00 0.00 0.00 0.00 0.00 0.00 160.81 161.07 447.33 881.58 882.01 1164.43 1274.62 1349.94 1350.06 2968.98 3107.02 3108.20
frequency: 160.81 161.07 447.33 881.58 882.01 1164.43 1274.62 1349.94 1350.06 2968.98 3107.02 3108.20
formula: CH3FSi
InChI: InChI=1/CH3FSi/c1-3-2/h1H3
6 atoms
F  2.665969 -0.001976 -0.009128
Si 1.14261 -0.000939 -0.003588
C  -0.725098 0.000571 0.002477
H  -1.024665 -0.327729 1.013443
H  -1.02766 1.039727 -0.217128
H  -1.031056 -0.709654 -0.785976
totalener: -427.70504703 hartree
nucrepener: 98.39866006 hartree
electener: -526.10370709 hartree
oneelecener: -770.41597788 hartree
twoeener: 244.31227079 hartree
kineticenergy: 426.20446650 hartree
exchangeener: -20.181422905129 hartree
correlationener: -1.411765895842 hartree
xcener: -21.593188800971 hartree
energy: -1835.9483 -698.5222 -298.9167 -169.4481 -123.0155 -123.0155 -122.7626 -51.2154 -35.8985 -31.1926 -28.8724 -28.8724 -26.8143 -26.6502 -26.6491 -16.2848 -15.5017 -15.5013 -8.0105 -7.0017 -7.0013 -6.2199 -3.2691 -2.1837 -2.1831 -1.3963 -1.3961 -0.6500 -0.3763 -0.3757 3.8444 3.8469 3.9921 12.6605 15.0345 15.0360 16.6715 19.4132 20.8121 20.8193 21.4537 21.4538 22.1589 27.2340 27.2346 32.4157 37.3439 37.3450 46.0110 47.8517 47.8530 71.9634 357.7297 881.1079 electronvolt
chargesum: 2.0000000
charge: -0.231113 1.764234 -0.855195 0.440673 0.440692 0.440710
charge: -0.005184 1.575405 -0.411990 0.280569 0.280587 0.280612
qa: -0.2311 1.7642 -0.8552 0.4407 0.4407 0.4407
va: 1.3070 2.4438 3.3984 0.7887 0.7887 0.7887
dispersion: -0.001587862 hartree
energy: -427.702183565551 hartree
dipole: -7.51847 5.28283 -2.23565 0.00570 -0.00426 0.00144 0.02526 -0.01718 0.00808
magnitude: 2.23566 au
magnitude: 5.68260 debye
temp: 298.15 k
press: 1.00 atm
zeropoint: 0.03840090 hartree
thermalvibcorrection: 0.00168088 hartree
thermalrotcorrection: 0.00141627 hartree
thermaltrasncorrection: 0.00141627 hartree
thermaltotal: -427.65926923 hartree
thermalcorr: 0.00451343 hartree
nonthermalcorr: 0.03840090 hartree
totalcorr: 0.04291433 hartree
thermalcorrenthalpy: 0.00094421 hartree
totalenthalpy: -427.65832503 hartree
vibrat: 0.00297687 hartree
rotat: 0.01045562 hartree
transl: 0.01819693 hartree
total: 0.03162941 hartree
totalentropycorr: -0.03162941 hartree
gibbsenthalpy: -427.68995444 hartree
gibbsminuselec: 0.01222912 hartree
