program: Orca
programVersion: 5.0.4
elementType: F Si C H H H
charge: 2
multiplicity: 1
keywords: Opt RIJCOSX PBEh-3c
formula: CH3FSi
InChI: InChI=1/CH3FSi/c1-3-2/h1H3
6 atoms
F  2.665969 -0.001977 -0.009128
Si 1.14261 -0.000939 -0.003588
C  -0.725098 0.000571 0.002477
H  -1.024665 -0.327729 1.013443
H  -1.02766 1.039727 -0.217128
H  -1.031056 -0.709654 -0.785976
totalener: -427.70504711 hartree
nucrepener: 98.39889324 hartree
electener: -526.10394035 hartree
oneelecener: -770.41618884 hartree
twoeener: 244.31224849 hartree
kineticenergy: 426.20406379 hartree
exchangeener: -20.181383938536 hartree
correlationener: -1.411762984316 hartree
xcener: -21.593146922852 hartree
dispersion: -0.001587862 hartree
energy: -1835.9494 -698.5232 -298.9158 -169.4489 -123.0164 -123.0163 -122.7635 -51.2160 -35.8983 -31.1931 -28.8730 -28.8729 -26.8143 -26.6498 -26.6487 -16.2850 -15.5020 -15.5016 -8.0103 -7.0016 -7.0011 -6.2201 -3.2691 -2.1841 -2.1835 -1.3966 -1.3964 -0.6500 -0.3765 -0.3758 3.8445 3.8470 3.9921 12.6605 15.0349 15.0364 16.6718 19.4134 20.8117 20.8189 21.4533 21.4534 22.1586 27.2338 27.2344 32.4154 37.3442 37.3453 46.0114 47.8522 47.8535 71.9629 357.7306 881.1070 electronvolt
chargesum: 2.0000000
charge: -0.231115 1.764325 -0.855235 0.440656 0.440676 0.440694
charge: -0.005174 1.575466 -0.412028 0.280558 0.280577 0.280601
qa: -0.2311 1.7643 -0.8552 0.4407 0.4407 0.4407
va: 1.3070 2.4438 3.3985 0.7887 0.7887 0.7887
energy: -427.702183570033 hartree
dipole: -7.51847 5.28312 -2.23535 0.00570 -0.00426 0.00144 0.02526 -0.01718 0.00808
magnitude: 2.23537 au
magnitude: 5.68185 debye
