program: Orca
programVersion: 6.0.1
elementType: O S C F F F O P C C C C C C C C C C C C O P C C C C C C C C C C C C O S C F F F O C C C C C C C C C C C C H H H H H H H H H H H H H H H H H H H H H H H H H H H H H H
charge: 0
multiplicity: 1
keywords: Freq RIJCOSX PBEh-3c
frequency: 0.00 0.00 0.00 0.00 0.00 0.00 -11.06 15.27 20.20 31.59 36.97 40.78 42.20 47.03 48.92 50.85 52.91 55.39 60.02 61.95 66.34 69.15 73.42 81.21 93.53 98.23 100.14 102.00 106.97 111.88 116.33 127.89 136.98 147.77 167.46 175.57 191.45 195.54 202.23 209.51 220.08 222.38 230.85 238.19 247.97 250.96 254.29 257.09 263.58 270.03 275.48 279.57 286.05 300.31 305.91 322.65 330.65 336.35 337.79 376.74 388.33 419.70 419.89 420.66 421.65 430.66 431.87 465.76 471.70 477.34 489.26 495.64 513.84 517.69 518.37 521.61 530.18 544.68 546.63 559.00 561.76 563.79 569.09 577.15 596.70 597.93 642.61 643.39 643.57 643.89 644.19 644.62 707.47 707.81 732.36 735.99 736.93 737.00 739.40 739.64 754.42 755.12 769.01 769.13 769.95 772.51 773.56 787.86 791.81 793.55 796.30 797.11 888.04 893.17 896.48 899.62 901.38 904.41 911.15 933.77 960.77 972.30 976.69 980.24 984.32 986.04 987.13 1024.01 1028.49 1029.34 1031.30 1036.22 1037.38 1041.62 1042.13 1042.68 1043.14 1044.75 1045.39 1047.94 1049.03 1049.59 1051.19 1052.28 1052.71 1084.56 1084.91 1086.65 1086.73 1086.85 1087.41 1144.64 1146.07 1148.10 1148.75 1149.67 1150.35 1166.77 1167.10 1185.86 1186.47 1188.02 1188.25 1196.71 1215.36 1217.67 1217.79 1218.11 1218.14 1218.40 1218.62 1232.41 1242.68 1253.56 1253.84 1254.27 1256.81 1257.40 1261.66 1287.35 1289.23 1291.66 1310.86 1368.77 1369.11 1375.75 1376.07 1376.18 1376.68 1407.57 1408.81 1409.58 1410.25 1410.51 1417.86 1519.54 1519.86 1525.23 1525.66 1526.49 1526.64 1575.96 1577.24 1577.55 1578.02 1578.61 1580.61 1696.57 1697.32 1699.80 1700.40 1701.24 1701.49 1716.07 1716.19 1716.50 1717.31 1718.21 1719.06 3267.50 3267.62 3268.60 3268.66 3268.99 3269.93 3274.85 3275.18 3277.41 3277.70 3278.01 3278.14 3281.87 3282.23 3283.17 3284.20 3284.70 3286.49 3289.12 3289.23 3290.07 3292.20 3293.14 3294.79 3295.23 3295.36 3296.24 3297.06 3297.81 3312.36
frequency: 15.27 20.20 31.59 36.97 40.78 42.20 47.03 48.92 50.85 52.91 55.39 60.02 61.95 66.34 69.15 73.42 81.21 93.53 98.23 100.14 102.00 106.97 111.88 116.33 127.89 136.98 147.77 167.46 175.57 191.45 195.54 202.23 209.51 220.08 222.38 230.85 238.19 247.97 250.96 254.29 257.09 263.58 270.03 275.48 279.57 286.05 300.31 305.91 322.65 330.65 336.35 337.79 376.74 388.33 419.70 419.89 420.66 421.65 430.66 431.87 465.76 471.70 477.34 489.26 495.64 513.84 517.69 518.37 521.61 530.18 544.68 546.63 559.00 561.76 563.79 569.09 577.15 596.70 597.93 642.61 643.39 643.57 643.89 644.19 644.62 707.47 707.81 732.36 735.99 736.93 737.00 739.40 739.64 754.42 755.12 769.01 769.13 769.95 772.51 773.56 787.86 791.81 793.55 796.30 797.11 888.04 893.17 896.48 899.62 901.38 904.41 911.15 933.77 960.77 972.30 976.69 980.24 984.32 986.04 987.13 1024.01 1028.49 1029.34 1031.30 1036.22 1037.38 1041.62 1042.13 1042.68 1043.14 1044.75 1045.39 1047.94 1049.03 1049.59 1051.19 1052.28 1052.71 1084.56 1084.91 1086.65 1086.73 1086.85 1087.41 1144.64 1146.07 1148.10 1148.75 1149.67 1150.35 1166.77 1167.10 1185.86 1186.47 1188.02 1188.25 1196.71 1215.36 1217.67 1217.79 1218.11 1218.14 1218.40 1218.62 1232.41 1242.68 1253.56 1253.84 1254.27 1256.81 1257.40 1261.66 1287.35 1289.23 1291.66 1310.86 1368.77 1369.11 1375.75 1376.07 1376.18 1376.68 1407.57 1408.81 1409.58 1410.25 1410.51 1417.86 1519.54 1519.86 1525.23 1525.66 1526.49 1526.64 1575.96 1577.24 1577.55 1578.02 1578.61 1580.61 1696.57 1697.32 1699.80 1700.40 1701.24 1701.49 1716.07 1716.19 1716.50 1717.31 1718.21 1719.06 3267.50 3267.62 3268.60 3268.66 3268.99 3269.93 3274.85 3275.18 3277.41 3277.70 3278.01 3278.14 3281.87 3282.23 3283.17 3284.20 3284.70 3286.49 3289.12 3289.23 3290.07 3292.20 3293.14 3294.79 3295.23 3295.36 3296.24 3297.06 3297.81 3312.36
formula: C38H30F6O5P2S2
InChI: InChI=1/C36H30OP2.2CF3O2S/c1-7-19-31(20-8-1)38(32-21-9-2-10-22-32,33-23-11-3-12-24-33)37-39(34-25-13-4-14-26-34,35-27-15-5-16-28-35)36-29-17-6-18-30-36;2*2-1(3,4)7(5)6/h1-30H;;
83 atoms
O  5.076888 1.510602 -0.230345
S  5.009194 0.058917 0.010475
C  5.391276 -0.072236 1.840283
F  6.627773 0.3800 2.035792
F  4.562882 0.630015 2.606986
F  5.350375 -1.345935 2.2286
O  3.545933 -0.507441 0.084724
P  1.628594 -0.221473 0.07935
C  1.69767 -0.719732 1.817735
C  1.110902 0.096272 2.779747
C  1.087909 -0.304509 4.106142
C  1.615768 -1.53392 4.471567
C  2.188647 -2.35186 3.509197
C  2.247918 -1.941002 2.186777
C  1.691591 -1.490192 -1.215154
C  2.36166 -1.249928 -2.409297
C  2.296037 -2.177368 -3.43609
C  1.603175 -3.367121 -3.260968
C  0.967518 -3.62272 -2.055911
C  0.994299 -2.679043 -1.03918
O  -0.033697 -0.115554 0.068592
P  -1.702781 0.034864 -0.049299
C  -1.654225 0.512978 -1.792168
C  -1.152711 -0.3929 -2.72291
C  -1.023724 -0.019627 -4.050178
C  -1.366613 1.264654 -4.449623
C  -1.860042 2.164988 -3.519555
C  -2.017295 1.791505 -2.192777
C  -1.786354 1.289992 1.251409
C  -1.073105 2.47415 1.11457
C  -1.080649 3.405003 2.14084
C  -1.764709 3.140848 3.317865
C  -2.465777 1.952543 3.456938
C  -2.494448 1.03419 2.419381
O  -3.607675 0.057637 -0.108999
S  -4.770958 1.12175 -0.173202
C  -5.277917 0.850973 -1.991488
F  -4.67304 -0.17578 -2.574143
F  -5.073506 1.939694 -2.715354
F  -6.590092 0.60157 -1.975475
O  -4.289283 2.516205 -0.157829
C  -1.978427 -1.704203 0.393413
C  -1.436433 -2.190421 1.578468
C  -1.563764 -3.533117 1.899716
C  -2.202604 -4.401167 1.026867
C  -2.741386 -3.915195 -0.155476
C  -2.650691 -2.566712 -0.464789
C  1.884641 1.505541 -0.373787
C  1.407343 1.958611 -1.598996
C  1.500458 3.303227 -1.92011
C  2.040124 4.200016 -1.009736
C  2.505897 3.745713 0.214116
C  2.447169 2.398073 0.527444
H  0.663252 1.042767 2.506031
H  0.643314 0.344094 4.848927
H  1.585424 -1.851937 5.505342
H  2.607049 -3.309457 3.788893
H  2.717671 -2.577712 1.4500
H  2.928596 -0.338697 -2.548563
H  2.802798 -1.975575 -4.370379
H  1.566749 -4.096055 -4.059763
H  0.434687 -4.551792 -1.903915
H  0.46724 -2.88221 -0.116455
H  -0.850335 -1.387648 -2.42398
H  -0.640102 -0.733112 -4.767007
H  -1.255371 1.558793 -5.484943
H  -2.140062 3.164526 -3.823759
H  -2.426659 2.500527 -1.485782
H  -0.514589 2.686069 0.212589
H  -0.539553 4.333583 2.019184
H  -1.757836 3.863303 4.123217
H  -3.005871 1.743179 4.370625
H  -3.063358 0.120229 2.531477
H  -0.906892 -1.535512 2.257906
H  -1.145651 -3.897458 2.828415
H  -2.28551 -5.452368 1.269538
H  -3.248888 -4.584796 -0.837024
H  -3.103122 -2.197246 -1.374828
H  0.953729 1.277427 -2.307213
H  1.134456 3.645949 -2.878335
H  2.100893 5.2518 -1.256281
H  2.939253 4.438131 0.922798
H  2.828656 2.060019 1.479429
totalener: -3913.53655154153603 hartree
nucrepener: 9510.57071773219104 hartree
kineticenergy: 3893.76224067173689 hartree
exchangeener: -226.422045988187 hartree
correlationener: -18.958356624042 hartree
xcener: -245.380402612229 hartree
energy: -2441.7526 -2441.5600 -2119.3840 -2119.3412 -683.8852 -683.8213 -683.7953 -683.7704 -683.7331 -683.6814 -530.5605 -530.3460 -530.2104 -529.5741 -529.2266 -290.8254 -290.6564 -285.1793 -285.1562 -285.1038 -285.0653 -285.0623 -284.9301 -284.8510 -284.8389 -284.8353 -284.8171 -284.8163 -284.7861 -284.7846 -284.7802 -284.7795 -284.7579 -284.7553 -284.7448 -284.7418 -284.7384 -284.7342 -284.7131 -284.6851 -284.6830 -284.6767 -284.6753 -284.6543 -284.6506 -284.6460 -284.6172 -284.6129 -284.6117 -284.5886 -284.5461 -284.4935 -284.4348 -227.2399 -227.0323 -188.7067 -188.6743 -169.8700 -169.8225 -169.6645 -169.6306 -169.6179 -169.4272 -136.8590 -136.8272 -136.7773 -136.7738 -136.7425 -136.7400 -39.3438 -39.2208 -36.8098 -36.7205 -36.6885 -36.6317 -31.9428 -31.6626 -30.7081 -29.5386 -29.2374 -26.7287 -26.6334 -26.5590 -26.5321 -26.4749 -26.3891 -24.5091 -23.8252 -23.4187 -23.4070 -23.3633 -23.3430 -23.2489 -23.2432 -23.2014 -23.1686 -23.1670 -23.0695 -22.1018 -22.0367 -21.4009 -20.6567 -19.8321 -19.3940 -19.2465 -19.2345 -19.1692 -19.1545 -18.9131 -18.9017 -18.8801 -18.8500 -18.8260 -18.7829 -18.1637 -18.1398 -18.1029 -18.0476 -18.0164 -17.8273 -17.5146 -16.7529 -16.6445 -16.6145 -16.4772 -16.4547 -16.2119 -15.7499 -15.2930 -14.8964 -14.8781 -14.7794 -14.7700 -14.7398 -14.6958 -14.6725 -14.6571 -14.4714 -14.4526 -14.4370 -14.4088 -14.3773 -14.2591 -14.2211 -14.1850 -14.0282 -13.9266 -13.8551 -13.8341 -13.7478 -13.7310 -13.6868 -13.6282 -13.5910 -13.5376 -13.4624 -13.4377 -13.3848 -13.3720 -13.2993 -13.1353 -13.0542 -13.0360 -12.9636 -12.9498 -12.9120 -12.7447 -12.2357 -12.1825 -12.1498 -11.9926 -11.9797 -11.7614 -11.6977 -11.5978 -11.5873 -11.4782 -11.3667 -11.3392 -11.2398 -11.2156 -11.1823 -11.0973 -11.0068 -10.9147 -10.6117 -10.4203 -10.1352 -9.9145 -9.7232 -9.5431 -9.3643 -9.1105 -8.6595 -8.6112 -8.5566 -8.4985 -8.3626 -8.3251 -8.2866 -8.2669 -8.2117 -8.1708 -8.1058 -8.0375 -7.4881 -7.1322 -0.4836 -0.4636 -0.4288 -0.2422 -0.2067 -0.1484 0.0207 0.1364 0.1734 0.2081 0.2587 electronvolt
chargesum: -0.0000000
charge: -0.659980 0.929713 0.788693 -0.294938 -0.286132 -0.296841 -0.784731 1.334173 -0.121305 -0.313169 -0.206682 -0.232776 -0.207778 -0.263120 -0.087798 -0.266472 -0.210099 -0.235524 -0.209299 -0.317187 -0.783448 1.328641 -0.110663 -0.314268 -0.206114 -0.235529 -0.202388 -0.329327 -0.112042 -0.300826 -0.200567 -0.230317 -0.203852 -0.280447 -0.762288 0.927052 0.786076 -0.279167 -0.275879 -0.303766 -0.657930 -0.111882 -0.311975 -0.209166 -0.234305 -0.212559 -0.261684 -0.121139 -0.313414 -0.204235 -0.229457 -0.205721 -0.248155 0.274872 0.230597 0.227656 0.228999 0.256400 0.255418 0.230551 0.228056 0.229754 0.273156 0.269028 0.228328 0.227026 0.233337 0.307602 0.272218 0.231532 0.227784 0.227608 0.256896 0.277071 0.231242 0.228411 0.229347 0.260459 0.268035 0.226775 0.225903 0.228173 0.259755
charge: -0.589815 0.859645 0.195842 -0.129190 -0.123266 -0.131398 -0.580147 0.970239 -0.175121 -0.130714 -0.133231 -0.125595 -0.133175 -0.118169 -0.164601 -0.117319 -0.133243 -0.128716 -0.134751 -0.132862 -0.465754 0.963841 -0.177752 -0.132152 -0.132531 -0.128294 -0.127727 -0.136402 -0.175420 -0.120701 -0.126695 -0.123185 -0.131213 -0.129125 -0.561271 0.866460 0.199898 -0.120586 -0.113381 -0.139354 -0.592947 -0.168429 -0.131219 -0.134966 -0.127605 -0.135309 -0.117715 -0.182369 -0.130257 -0.133810 -0.122021 -0.125810 -0.110753 0.154887 0.142200 0.139682 0.140851 0.152479 0.150769 0.141354 0.139712 0.141720 0.154466 0.152330 0.141333 0.139513 0.142744 0.162697 0.155557 0.142904 0.139973 0.140272 0.150093 0.155629 0.142398 0.139838 0.140839 0.152836 0.152272 0.140778 0.139388 0.141381 0.149245
qa: -0.6600 0.9297 0.7887 -0.2949 -0.2861 -0.2968 -0.7847 1.3342 -0.1213 -0.3132 -0.2067 -0.2328 -0.2078 -0.2631 -0.0878 -0.2665 -0.2101 -0.2355 -0.2093 -0.3172 -0.7834 1.3286 -0.1107 -0.3143 -0.2061 -0.2355 -0.2024 -0.3293 -0.1120 -0.3008 -0.2006 -0.2303 -0.2039 -0.2804 -0.7623 0.9271 0.7861 -0.2792 -0.2759 -0.3038 -0.6579 -0.1119 -0.3120 -0.2092 -0.2343 -0.2126 -0.2617 -0.1211 -0.3134 -0.2042 -0.2295 -0.2057 -0.2482 0.2749 0.2306 0.2277 0.2290 0.2564 0.2554 0.2306 0.2281 0.2298 0.2732 0.2690 0.2283 0.2270 0.2333 0.3076 0.2722 0.2315 0.2278 0.2276 0.2569 0.2771 0.2312 0.2284 0.2293 0.2605 0.2680 0.2268 0.2259 0.2282 0.2598
va: 1.8532 3.6161 3.9511 1.1097 1.1186 1.1055 1.7111 4.2487 3.7499 3.8462 3.8232 3.8108 3.8130 3.8418 3.7290 3.8387 3.8162 3.8114 3.8236 3.8523 1.7990 4.2594 3.7433 3.8493 3.8259 3.8099 3.8224 3.8022 3.7638 3.8496 3.8252 3.8130 3.8179 3.8363 1.7461 3.5684 3.9618 1.1304 1.1325 1.0974 1.8650 3.7384 3.8541 3.8238 3.8095 3.8104 3.8248 3.7625 3.8484 3.8288 3.8121 3.8366 3.8429 0.8882 0.9096 0.9091 0.9083 0.9088 0.9081 0.9078 0.9089 0.9100 0.8885 0.8907 0.9112 0.9093 0.9075 0.8974 0.8898 0.9094 0.9089 0.9087 0.9058 0.8869 0.9093 0.9088 0.9083 0.9102 0.8911 0.9117 0.9097 0.9096 0.9118
dispersion: -0.095915696 hartree
energy: -3913.467984404157 hartree
dipole: -0.937978109 0.414058491 -0.523919618 -7.021515849 5.478871744 -1.542644105 1.095063022 -0.909545185 0.185517837
dipolemethod: SCF
magnitude: 1.639713228 au
magnitude: 4.167819803 debye
temp: 298.15 k
press: 1.00 atm
zeropoint: 0.62281826 hartree
thermalvibcorrection: 0.04435780 hartree
thermalrotcorrection: 0.00141627 hartree
thermaltrasncorrection: 0.00141627 hartree
thermaltotal: -3912.79797580 hartree
thermalcorr: 0.04719034 hartree
nonthermalcorr: 0.62281826 hartree
totalcorr: 0.67000861 hartree
thermalcorrenthalpy: 0.00094421 hartree
totalenthalpy: -3912.79703159 hartree
vibrat: 0.07971203 hartree
rotat: 0.01852068 hartree
transl: 0.02182812 hartree
total: 0.12006083 hartree
totalentropycorr: -0.12006083 hartree
gibbsenthalpy: -3912.91709242 hartree
gibbsminuselec: 0.55089198 hartree
