program: Orca
programVersion: 6.0.1
elementType: C P C C C C C C C C C C C C P C C C C C C C C C C C C C C C C C C C C C C C H H H H H H H H H H H H H H H H H H H H H H H H H H H H H H
charge: 2
multiplicity: 1
keywords: Opt RIJCOSX PBEh-3c
formula: C36H30P2
InChI: InChI=1/2C18H15P/c2*1-4-10-16(11-5-1)19(17-12-6-2-7-13-17)18-14-8-3-9-15-18/h2*1-15H
68 atoms
C  -1.727093 0.224125 -1.628357
P  -1.131499 0.002526 0.042561
C  -1.632345 -1.574188 0.717867
C  -2.504908 -2.383667 -0.009506
C  -2.897963 -3.605095 0.513963
C  -2.425399 -4.018103 1.750456
C  -1.564858 -3.205828 2.48044
C  -1.166774 -1.982712 1.973634
C  -1.621544 1.359118 1.097267
C  -1.204085 2.662874 0.803988
C  -1.602426 3.704314 1.621199
C  -2.416602 3.45728 2.720922
C  -2.840979 2.167524 3.00219
C  -2.446752 1.11241 2.194709
P  1.132622 -0.000683 -0.04305
C  1.621295 -1.358615 -1.096848
C  1.204041 -2.662446 -0.80352
C  1.600124 -3.703428 -1.622439
C  2.411636 -3.455991 -2.723984
C  2.835821 -2.16618 -3.005409
C  2.443914 -1.111534 -2.196283
C  1.638951 1.574309 -0.718401
C  2.525888 2.373905 0.00251
C  2.926894 3.591975 -0.522918
C  2.448112 4.011317 -1.754842
C  1.573077 3.208785 -2.478369
C  1.167013 1.989106 -1.969673
C  1.723055 -0.221429 1.629646
C  1.331936 0.668258 2.637501
C  1.803249 0.486354 3.924378
C  2.664413 -0.567119 4.21032
C  3.063781 -1.437717 3.207685
C  2.595788 -1.271954 1.91374
C  -1.329794 -0.656152 -2.642009
C  -1.809234 -0.47431 -3.925902
C  -2.684738 0.569584 -4.203233
C  -3.089617 1.431081 -3.195014
C  -2.613504 1.265473 -1.903999
H  -2.888979 -2.070402 -0.970653
H  -3.5802 -4.230648 -0.044658
H  -2.735861 -4.972174 2.154561
H  -1.21002 -3.523576 3.451014
H  -0.509849 -1.354621 2.560724
H  -0.583115 2.873789 -0.056305
H  -1.284745 4.712995 1.396229
H  -2.728696 4.276832 3.354079
H  -3.486637 1.9791 3.848621
H  -2.79346 0.113182 2.420222
H  0.585218 -2.873848 0.058143
H  1.282687 -4.712141 -1.397288
H  2.721849 -4.275226 -3.358473
H  3.479488 -1.97739 -3.853272
H  2.790061 -0.112192 -2.422151
H  2.915095 2.05578 0.960002
H  3.619999 4.209923 0.030765
H  2.764737 4.962738 -2.160404
H  1.213062 3.53151 -3.445393
H  0.49884 1.368502 -2.551995
H  0.67596 1.502242 2.426416
H  1.505983 1.172319 4.705474
H  3.032782 -0.70184 5.21833
H  3.746444 -2.246374 3.428847
H  2.922421 -1.951727 1.138944
H  -0.661918 -1.482519 -2.438305
H  -1.506838 -1.1529 -4.711459
H  -3.05944 0.704164 -5.208921
H  -3.78265 2.232681 -3.409509
H  -2.944016 1.938553 -1.125007
totalener: -2068.25040777056893 hartree
nucrepener: 4683.89195752797696 hartree
electener: -6752.14236529854588 hartree
twoeener: 5332.90357123485319 hartree
kineticenergy: 2056.00386381399585 hartree
exchangeener: -135.170328897564 hartree
correlationener: -12.166052185357 hartree
xcener: -147.336381082921 hartree
dispersion: -0.071385938 hartree
dispersion: -0.071403249 hartree
dispersion: -0.071376316 hartree
dispersion: -0.071347640 hartree
dispersion: -0.071396831 hartree
dispersion: -0.071359386 hartree
dispersion: -0.071398327 hartree
dispersion: -0.071392688 hartree
dispersion: -0.071385112 hartree
dispersion: -0.071401140 hartree
dispersion: -0.071390305 hartree
energy: -2124.4317 -2124.4301 -291.1771 -291.1767 -291.1763 -291.1756 -291.1752 -291.1746 -290.6283 -290.6270 -290.6264 -290.6260 -290.6255 -290.6248 -290.5909 -290.5906 -290.5881 -290.5878 -290.5878 -290.5869 -290.1882 -290.1876 -290.1874 -290.1866 -290.1866 -290.1848 -290.1439 -290.1435 -290.1431 -290.1427 -290.1426 -290.1425 -290.0765 -290.0764 -290.0762 -290.0760 -290.0754 -290.0743 -194.2049 -194.2037 -142.2746 -142.2676 -142.2639 -142.2638 -142.2633 -142.2631 -32.8246 -32.5016 -32.1910 -32.1889 -32.1345 -32.1332 -30.4981 -29.9266 -29.0880 -29.0863 -28.9737 -28.9730 -28.8610 -28.8154 -28.8056 -28.8048 -28.8032 -28.8024 -27.1263 -26.2326 -24.8878 -24.8857 -24.7735 -24.7716 -24.6129 -24.4607 -24.4582 -24.4296 -24.4285 -24.4226 -23.6216 -23.2453 -22.1911 -22.1894 -21.9774 -21.9763 -21.6652 -21.2141 -20.5194 -20.4006 -20.3989 -20.2959 -20.2935 -20.0699 -19.9688 -19.9685 -19.9677 -19.9649 -19.7042 -19.5878 -19.3641 -19.2580 -19.2569 -19.2213 -19.2201 -19.0526 -19.0449 -19.0427 -18.7441 -18.7414 -18.6751 -17.6891 -17.6539 -17.6511 -17.6449 -17.6408 -17.5660 -17.1783 -16.9911 -16.9047 -16.9027 -16.8163 -16.8130 -16.7952 -16.6126 -16.6100 -16.5267 -16.4709 -16.4689 -14.5620 -14.3596 -14.3592 -14.2377 -14.2317 -14.1341 -14.0199 -13.9262 -13.9233 -13.8947 -13.8918 -13.7962 -7.5877 -6.7253 -6.7221 -6.2376 -6.2260 -5.9804 -5.7596 -5.5822 -5.4196 -5.4090 -5.1776 electronvolt
chargesum: 2.0000000
charge: -0.208825 0.710318 -0.209305 -0.227950 -0.203669 -0.209138 -0.202992 -0.272715 -0.211195 -0.270260 -0.203153 -0.208930 -0.203763 -0.228130 0.709944 -0.211088 -0.270621 -0.202871 -0.209025 -0.203691 -0.228197 -0.209490 -0.227904 -0.203702 -0.208902 -0.203130 -0.272423 -0.208619 -0.272536 -0.203735 -0.208455 -0.203903 -0.227686 -0.273045 -0.203639 -0.208283 -0.203919 -0.227345 0.284185 0.283395 0.288244 0.278190 0.287820 0.287588 0.278135 0.288319 0.283471 0.284314 0.287565 0.278059 0.288304 0.283465 0.284310 0.284180 0.283455 0.288268 0.278219 0.288046 0.287962 0.278243 0.288203 0.283418 0.284302 0.288150 0.278230 0.288210 0.283461 0.284258
charge: -0.231648 0.821955 -0.232150 -0.105519 -0.107406 -0.073505 -0.110821 -0.131637 -0.232304 -0.131496 -0.110829 -0.073320 -0.107267 -0.105544 0.821958 -0.232416 -0.131445 -0.110837 -0.073303 -0.107329 -0.105592 -0.232131 -0.105486 -0.107227 -0.073429 -0.110747 -0.131901 -0.231662 -0.132042 -0.110973 -0.073399 -0.107137 -0.105159 -0.132476 -0.110931 -0.073339 -0.106969 -0.105069 0.163506 0.166411 0.167956 0.163834 0.158319 0.158332 0.163821 0.167992 0.166472 0.163485 0.158369 0.163792 0.167990 0.166470 0.163503 0.163535 0.166449 0.167973 0.163841 0.158268 0.158301 0.163833 0.167946 0.166459 0.163539 0.158296 0.163806 0.167958 0.166493 0.163585
qa: -0.2088 0.7103 -0.2093 -0.2279 -0.2037 -0.2091 -0.2030 -0.2727 -0.2112 -0.2703 -0.2032 -0.2089 -0.2038 -0.2281 0.7099 -0.2111 -0.2706 -0.2029 -0.2090 -0.2037 -0.2282 -0.2095 -0.2279 -0.2037 -0.2089 -0.2031 -0.2724 -0.2086 -0.2725 -0.2037 -0.2085 -0.2039 -0.2277 -0.2730 -0.2036 -0.2083 -0.2039 -0.2273 0.2842 0.2834 0.2882 0.2782 0.2878 0.2876 0.2781 0.2883 0.2835 0.2843 0.2876 0.2781 0.2883 0.2835 0.2843 0.2842 0.2835 0.2883 0.2782 0.2880 0.2880 0.2782 0.2882 0.2834 0.2843 0.2882 0.2782 0.2882 0.2835 0.2843
va: 3.7186 4.0595 3.7171 3.7911 3.7937 3.7640 3.8060 3.7801 3.7182 3.7792 3.8060 3.7638 3.7941 3.7909 4.0597 3.7179 3.7795 3.8058 3.7639 3.7940 3.7911 3.7172 3.7909 3.7940 3.7639 3.8061 3.7801 3.7186 3.7796 3.8060 3.7638 3.7939 3.7912 3.7800 3.8060 3.7638 3.7942 3.7911 0.8830 0.8866 0.8844 0.8895 0.8773 0.8770 0.8895 0.8843 0.8866 0.8831 0.8770 0.8895 0.8843 0.8866 0.8831 0.8831 0.8866 0.8843 0.8895 0.8768 0.8767 0.8895 0.8844 0.8866 0.8830 0.8762 0.8895 0.8844 0.8866 0.8830
dispersion: -0.071390814 hartree
energy: -2068.228822875028 hartree
dipole: -0.004573267 0.004020557 -0.000552710 -0.008215220 0.009619963 0.001404743 -0.001094590 0.000594772 -0.000499818
dipolemethod: SCF
magnitude: 0.001590160 au
magnitude: 0.004041866 debye
