program: Orca
programVersion: 6.0.1
elementType: O P C C C C C C C C C C C C C C C C C C H H H H H H H H H H H H H H H
charge: 0
multiplicity: 1
keywords: Freq RIJCOSX PBEh-3c
frequency: 0.00 0.00 0.00 0.00 0.00 0.00 26.63 30.31 42.15 52.28 54.18 75.45 180.61 182.76 184.12 257.01 257.41 259.40 304.93 305.76 416.70 417.45 418.35 421.10 472.81 475.45 516.28 567.97 568.28 642.75 643.15 644.12 716.01 734.92 735.28 736.85 751.67 752.49 788.24 797.94 798.22 902.01 902.10 905.65 983.10 983.39 986.01 1036.21 1036.49 1038.62 1041.54 1042.04 1042.27 1058.58 1059.22 1059.75 1084.65 1085.89 1086.19 1141.69 1142.10 1142.69 1160.32 1177.78 1178.16 1216.60 1217.19 1217.37 1247.77 1248.22 1250.20 1275.30 1370.44 1370.68 1371.15 1404.94 1405.35 1407.14 1520.89 1521.06 1523.20 1574.30 1575.12 1575.47 1697.63 1697.85 1698.90 1717.08 1717.13 1717.24 3261.80 3262.22 3262.60 3268.51 3268.85 3269.05 3276.35 3276.79 3277.09 3284.27 3284.56 3284.79 3291.80 3291.90 3292.09
frequency: 26.63 30.31 42.15 52.28 54.18 75.45 180.61 182.76 184.12 257.01 257.41 259.40 304.93 305.76 416.70 417.45 418.35 421.10 472.81 475.45 516.28 567.97 568.28 642.75 643.15 644.12 716.01 734.92 735.28 736.85 751.67 752.49 788.24 797.94 798.22 902.01 902.10 905.65 983.10 983.39 986.01 1036.21 1036.49 1038.62 1041.54 1042.04 1042.27 1058.58 1059.22 1059.75 1084.65 1085.89 1086.19 1141.69 1142.10 1142.69 1160.32 1177.78 1178.16 1216.60 1217.19 1217.37 1247.77 1248.22 1250.20 1275.30 1370.44 1370.68 1371.15 1404.94 1405.35 1407.14 1520.89 1521.06 1523.20 1574.30 1575.12 1575.47 1697.63 1697.85 1698.90 1717.08 1717.13 1717.24 3261.80 3262.22 3262.60 3268.51 3268.85 3269.05 3276.35 3276.79 3277.09 3284.27 3284.56 3284.79 3291.80 3291.90 3292.09
formula: C18H15OP
InChI: InChI=1/C18H15OP/c19-20(16-10-4-1-5-11-16,17-12-6-2-7-13-17)18-14-8-3-9-15-18/h1-15H
35 atoms
O  0.172872 -0.424531 -2.613685
P  0.075354 -0.182875 -1.144387
C  -0.315332 1.538776 -0.731273
C  0.143887 2.176014 0.416666
C  -0.211191 3.492285 0.672392
C  -1.019858 4.178772 -0.220843
C  -1.468816 3.551357 -1.374357
C  -1.115786 2.236671 -1.63227
C  1.610701 -0.568474 -0.260151
C  2.801844 -0.427879 -0.966979
C  4.012691 -0.688789 -0.345476
C  4.040887 -1.096126 0.98072
C  2.855969 -1.249945 1.685075
C  1.642862 -0.991034 1.065236
C  -1.208413 -1.179686 -0.340737
C  -1.92754 -0.750111 0.769998
C  -2.88033 -1.577256 1.346046
C  -3.123211 -2.833121 0.810304
C  -2.418275 -3.259994 -0.306268
C  -1.465843 -2.435934 -0.883628
H  0.793678 1.65549 1.109241
H  0.151597 3.984169 1.565235
H  -1.293717 5.206746 -0.022503
H  -2.089602 4.089924 -2.078037
H  -1.450606 1.75063 -2.5397
H  2.775932 -0.124595 -2.005709
H  4.936039 -0.580173 -0.898876
H  4.987209 -1.30264 1.463338
H  2.874761 -1.581435 2.714845
H  0.720488 -1.13458 1.614538
H  -1.758104 0.237255 1.181709
H  -3.439152 -1.236627 2.207692
H  -3.869154 -3.47675 1.257992
H  -2.616042 -4.234798 -0.732025
H  -0.925997 -2.760432 -1.764024
totalener: -1109.47892953659539 hartree
nucrepener: 1585.23924904138676 hartree
electener: -2694.71817857798214 hartree
oneelecener: -4663.53524374376138 hartree
twoeener: 1968.81706516577947 hartree
kineticenergy: 1102.81559542924015 hartree
exchangeener: -72.370894366208 hartree
correlationener: -6.484284213465 hartree
xcener: -78.855178579673 hartree
energy: -2117.5256 -528.6451 -284.6653 -284.6628 -284.6601 -284.6124 -284.6119 -284.6089 -284.6057 -284.6018 -284.5995 -284.5623 -284.5577 -284.5555 -284.5516 -284.5505 -284.5484 -284.5070 -284.5041 -284.5037 -187.1139 -135.2044 -135.2039 -135.1921 -28.6868 -26.4060 -26.2847 -26.2816 -23.6706 -23.0971 -23.0924 -23.0822 -22.9818 -22.9782 -19.9491 -18.8918 -18.8825 -18.8717 -18.5762 -18.5718 -17.2983 -16.2958 -16.2918 -15.5127 -14.4628 -14.4580 -14.3853 -14.1640 -14.1615 -13.9427 -13.3912 -13.3856 -13.3806 -13.2164 -13.2023 -12.0759 -11.8544 -11.8461 -11.6904 -11.2681 -11.1219 -11.1167 -10.8945 -10.8834 -10.8139 -8.7622 -8.7516 -8.3138 -8.2946 -8.2884 -8.1672 -8.1545 -8.1157 -0.2977 -0.2743 -0.0176 0.0892 0.4099 0.4284 3.3673 3.4660 3.8125 3.8149 4.4304 electronvolt
chargesum: -0.0000000
charge: -0.634043 1.117895 -0.200502 -0.242935 -0.206883 -0.224816 -0.204838 -0.266457 -0.200308 -0.268412 -0.204739 -0.224328 -0.208114 -0.243080 -0.197488 -0.244525 -0.207595 -0.224729 -0.204444 -0.266997 0.248865 0.224560 0.226553 0.227047 0.258503 0.259714 0.226967 0.226458 0.224513 0.249119 0.248992 0.224510 0.226445 0.226909 0.258179
charge: -0.552745 0.890715 -0.199848 -0.131878 -0.135430 -0.120894 -0.131390 -0.110338 -0.199946 -0.110617 -0.131456 -0.120807 -0.135563 -0.131983 -0.199510 -0.132331 -0.135457 -0.120936 -0.131288 -0.110337 0.145479 0.138507 0.138720 0.139909 0.154792 0.155364 0.139861 0.138693 0.138518 0.145076 0.145393 0.138498 0.138681 0.139844 0.154707
qa: -0.6340 1.1179 -0.2005 -0.2429 -0.2069 -0.2248 -0.2048 -0.2665 -0.2003 -0.2684 -0.2047 -0.2243 -0.2081 -0.2431 -0.1975 -0.2445 -0.2076 -0.2247 -0.2044 -0.2670 0.2489 0.2246 0.2266 0.2270 0.2585 0.2597 0.2270 0.2265 0.2245 0.2491 0.2490 0.2245 0.2264 0.2269 0.2582
va: 2.0246 4.6006 3.7057 3.7881 3.8200 3.8140 3.8011 3.8231 3.7077 3.8236 3.8000 3.8140 3.8219 3.7873 3.7067 3.7895 3.8209 3.8142 3.8008 3.8226 0.9005 0.9099 0.9091 0.9087 0.9099 0.9099 0.9088 0.9091 0.9099 0.9004 0.9005 0.9099 0.9091 0.9088 0.9101
dispersion: -0.028561537 hartree
energy: -1109.459645484156 hartree
dipole: -0.460955663 0.354890140 -0.106065523 1.120135321 -0.859812435 0.260322886 6.993945829 -5.381956014 1.611989815
dipolemethod: SCF
magnitude: 1.636315698 au
magnitude: 4.159183970 debye
temp: 298.15 k
press: 1.00 atm
zeropoint: 0.28749652 hartree
thermalvibcorrection: 0.01347758 hartree
thermalrotcorrection: 0.00141627 hartree
thermaltrasncorrection: 0.00141627 hartree
thermaltotal: -1109.15583884 hartree
thermalcorr: 0.01631012 hartree
nonthermalcorr: 0.28749652 hartree
totalcorr: 0.30380664 hartree
thermalcorrenthalpy: 0.00094421 hartree
totalenthalpy: -1109.15489463 hartree
vibrat: 0.02357528 hartree
rotat: 0.01611007 hartree
transl: 0.02032079 hartree
total: 0.06000614 hartree
totalentropycorr: -0.06000614 hartree
gibbsenthalpy: -1109.21490078 hartree
gibbsminuselec: 0.24474471 hartree
