program: Orca
programVersion: 6.0.1
elementType: O P C C C C C C C C C C C C C C C C C C H H H H H H H H H H H H H H H
charge: 0
multiplicity: 1
keywords: Freq RIJCOSX PBEh-3c
frequency: 0.00 0.00 0.00 0.00 0.00 0.00 26.60 29.15 40.60 52.45 53.22 74.81 180.12 181.43 183.61 256.55 257.87 259.21 304.51 304.96 416.84 417.27 417.53 421.07 473.25 474.71 516.86 567.24 568.38 643.24 643.39 644.36 716.27 735.03 735.19 736.90 751.96 752.43 788.18 797.68 798.12 901.74 901.77 905.32 982.96 983.34 985.83 1036.12 1036.22 1038.44 1041.88 1042.29 1042.44 1058.42 1058.79 1059.32 1084.90 1086.19 1086.34 1142.03 1142.23 1142.67 1160.66 1178.07 1178.31 1217.17 1217.58 1217.90 1248.21 1248.52 1250.55 1275.58 1370.62 1370.83 1371.13 1405.08 1405.39 1407.13 1520.94 1521.20 1523.12 1574.49 1575.36 1575.63 1697.80 1698.04 1698.97 1716.98 1717.04 1717.18 3262.36 3262.46 3262.72 3268.84 3268.95 3269.05 3276.31 3276.50 3276.61 3284.13 3284.34 3284.36 3291.68 3291.83 3292.03
frequency: 26.60 29.15 40.60 52.45 53.22 74.81 180.12 181.43 183.61 256.55 257.87 259.21 304.51 304.96 416.84 417.27 417.53 421.07 473.25 474.71 516.86 567.24 568.38 643.24 643.39 644.36 716.27 735.03 735.19 736.90 751.96 752.43 788.18 797.68 798.12 901.74 901.77 905.32 982.96 983.34 985.83 1036.12 1036.22 1038.44 1041.88 1042.29 1042.44 1058.42 1058.79 1059.32 1084.90 1086.19 1086.34 1142.03 1142.23 1142.67 1160.66 1178.07 1178.31 1217.17 1217.58 1217.90 1248.21 1248.52 1250.55 1275.58 1370.62 1370.83 1371.13 1405.08 1405.39 1407.13 1520.94 1521.20 1523.12 1574.49 1575.36 1575.63 1697.80 1698.04 1698.97 1716.98 1717.04 1717.18 3262.36 3262.46 3262.72 3268.84 3268.95 3269.05 3276.31 3276.50 3276.61 3284.13 3284.34 3284.36 3291.68 3291.83 3292.03
formula: C18H15OP
InChI: InChI=1/C18H15OP/c19-20(16-10-4-1-5-11-16,17-12-6-2-7-13-17)18-14-8-3-9-15-18/h1-15H
35 atoms
O  0.313083 0.903692 -2.477649
P  0.139465 0.393368 -1.086203
C  1.692909 -0.155297 -0.32964
C  2.671597 -0.657295 -1.183234
C  3.87578 -1.110551 -0.668504
C  4.112136 -1.059084 0.697846
C  3.145432 -0.547112 1.550501
C  1.939624 -0.092413 1.038093
C  -0.985339 -1.025042 -0.98345
C  -0.857124 -2.039576 -0.040127
C  -1.770546 -3.082942 -0.009941
C  -2.810895 -3.120425 -0.926236
C  -2.934363 -2.117916 -1.877801
C  -2.023186 -1.074546 -1.910344
C  -0.541786 1.634195 0.047483
C  -1.376814 1.318917 1.11441
C  -1.848507 2.320376 1.950269
C  -1.494192 3.640954 1.718891
C  -0.672488 3.961635 0.647538
C  -0.199524 2.963254 -0.188729
H  2.4920 -0.681139 -2.250486
H  4.633976 -1.498423 -1.335802
H  5.054452 -1.410471 1.097371
H  3.333064 -0.492599 2.614694
H  1.19842 0.324732 1.708618
H  -0.035499 -2.026668 0.665215
H  -1.663158 -3.870408 0.724239
H  -3.521371 -3.936396 -0.90389
H  -3.738904 -2.153064 -2.600355
H  -2.109656 -0.301214 -2.662923
H  -1.675829 0.292931 1.289949
H  -2.499815 2.069117 2.776961
H  -1.865286 4.422541 2.368869
H  -0.405164 4.992915 0.458912
H  0.427706 3.213954 -1.034645
totalener: -1109.47892124294822 hartree
nucrepener: 1585.34000546846119 hartree
electener: -2694.81892671140940 hartree
oneelecener: -4663.73680664132826 hartree
twoeener: 1968.91787992991863 hartree
kineticenergy: 1102.81511260577167 hartree
exchangeener: -72.370836016381 hartree
correlationener: -6.484368429814 hartree
xcener: -78.855204446195 hartree
energy: -2117.5254 -528.6444 -284.6651 -284.6631 -284.6566 -284.6133 -284.6132 -284.6086 -284.6036 -284.6030 -284.5998 -284.5604 -284.5601 -284.5595 -284.5524 -284.5522 -284.5464 -284.5064 -284.5062 -284.5035 -187.1132 -135.2038 -135.2034 -135.1912 -28.6846 -26.4070 -26.2857 -26.2817 -23.6717 -23.0970 -23.0938 -23.0811 -22.9802 -22.9789 -19.9493 -18.8892 -18.8811 -18.8753 -18.5743 -18.5739 -17.2990 -16.2949 -16.2937 -15.5110 -14.4660 -14.4594 -14.3835 -14.1655 -14.1597 -13.9409 -13.3902 -13.3849 -13.3806 -13.2134 -13.2047 -12.0766 -11.8525 -11.8460 -11.6908 -11.2658 -11.1215 -11.1197 -10.8940 -10.8846 -10.8149 -8.7601 -8.7530 -8.3162 -8.2925 -8.2879 -8.1622 -8.1540 -8.1206 -0.2899 -0.2738 -0.0281 0.0827 0.4141 0.4301 3.3708 3.4778 3.8075 3.8120 4.4289 electronvolt
chargesum: -0.0000000
charge: -0.633721 1.119010 -0.200110 -0.267969 -0.204624 -0.224595 -0.207864 -0.242889 -0.202289 -0.242081 -0.207273 -0.224826 -0.204879 -0.266662 -0.199450 -0.243512 -0.207160 -0.225027 -0.204463 -0.266679 0.259065 0.227021 0.226539 0.224589 0.248984 0.248907 0.224545 0.226556 0.227065 0.258834 0.249276 0.224494 0.226452 0.226906 0.257828
charge: -0.552458 0.890562 -0.200074 -0.110510 -0.131417 -0.120851 -0.135485 -0.131888 -0.200029 -0.131838 -0.135477 -0.120934 -0.131435 -0.110486 -0.199762 -0.132059 -0.135451 -0.120954 -0.131400 -0.110257 0.155104 0.139868 0.138722 0.138530 0.145284 0.145441 0.138539 0.138722 0.139881 0.154945 0.145655 0.138485 0.138684 0.139826 0.154516
qa: -0.6337 1.1190 -0.2001 -0.2680 -0.2046 -0.2246 -0.2079 -0.2429 -0.2023 -0.2421 -0.2073 -0.2248 -0.2049 -0.2667 -0.1994 -0.2435 -0.2072 -0.2250 -0.2045 -0.2667 0.2591 0.2270 0.2265 0.2246 0.2490 0.2489 0.2245 0.2266 0.2271 0.2588 0.2493 0.2245 0.2265 0.2269 0.2578
va: 2.0248 4.6009 3.7071 3.8233 3.8004 3.8141 3.8214 3.7875 3.7074 3.7879 3.8201 3.8138 3.8012 3.8227 3.7060 3.7890 3.8205 3.8143 3.8013 3.8231 0.9100 0.9088 0.9091 0.9099 0.9006 0.9004 0.9099 0.9091 0.9087 0.9098 0.9002 0.9099 0.9091 0.9088 0.9101
dispersion: -0.028568614 hartree
energy: -1109.459683184585 hartree
dipole: -0.852207137 0.662088507 -0.190118630 -2.401574615 1.844068231 -0.557506384 6.636873847 -5.106752796 1.530121051
dipolemethod: SCF
magnitude: 1.639581926 au
magnitude: 4.167486060 debye
temp: 298.15 k
press: 1.00 atm
zeropoint: 0.28748629 hartree
thermalvibcorrection: 0.01349241 hartree
thermalrotcorrection: 0.00141627 hartree
thermaltrasncorrection: 0.00141627 hartree
thermaltotal: -1109.15587194 hartree
thermalcorr: 0.01632495 hartree
nonthermalcorr: 0.28748629 hartree
totalcorr: 0.30381124 hartree
thermalcorrenthalpy: 0.00094421 hartree
totalenthalpy: -1109.15492773 hartree
vibrat: 0.02363170 hartree
rotat: 0.01610959 hartree
transl: 0.02032079 hartree
total: 0.06006209 hartree
totalentropycorr: -0.06006209 hartree
gibbsenthalpy: -1109.21498982 hartree
gibbsminuselec: 0.24469336 hartree
