program: Orca
programVersion: 6.0.1
elementType: C P C C C C C C C C C C C C P C C C C C C C C C C C C C C C C C C C C C C C H H H H H H H H H H H H H H H H H H H H H H H H H H H H H H
charge: 2
multiplicity: 1
keywords: SP DSD-BLYP D3BJ def2-QZVPP def2-QZVPP/C def2/J TightSCF
formula: C36H30P2
InChI: InChI=1/2C18H15P/c2*1-4-10-16(11-5-1)19(17-12-6-2-7-13-17)18-14-8-3-9-15-18/h2*1-15H
68 atoms
C  -1.727093 0.224125 -1.628357
P  -1.131499 0.002526 0.042561
C  -1.632345 -1.574188 0.717867
C  -2.504908 -2.383667 -0.009506
C  -2.897963 -3.605095 0.513963
C  -2.425399 -4.018103 1.750456
C  -1.564858 -3.205828 2.48044
C  -1.166774 -1.982712 1.973634
C  -1.621544 1.359118 1.097267
C  -1.204085 2.662874 0.803988
C  -1.602426 3.704314 1.621199
C  -2.416602 3.45728 2.720922
C  -2.840979 2.167524 3.00219
C  -2.446752 1.11241 2.194709
P  1.132622 -0.000683 -0.04305
C  1.621295 -1.358615 -1.096848
C  1.204041 -2.662446 -0.80352
C  1.600124 -3.703428 -1.622439
C  2.411636 -3.455991 -2.723984
C  2.835821 -2.16618 -3.005409
C  2.443914 -1.111534 -2.196283
C  1.638951 1.574309 -0.718401
C  2.525888 2.373905 0.00251
C  2.926894 3.591975 -0.522918
C  2.448112 4.011317 -1.754842
C  1.573077 3.208785 -2.478369
C  1.167013 1.989106 -1.969673
C  1.723055 -0.221429 1.629646
C  1.331936 0.668258 2.637501
C  1.803249 0.486354 3.924378
C  2.664413 -0.567119 4.21032
C  3.063781 -1.437717 3.207685
C  2.595788 -1.271954 1.91374
C  -1.329794 -0.656152 -2.642009
C  -1.809234 -0.47431 -3.925902
C  -2.684738 0.569584 -4.203233
C  -3.089617 1.431081 -3.195014
C  -2.613504 1.265473 -1.903999
H  -2.888979 -2.070402 -0.970653
H  -3.5802 -4.230648 -0.044658
H  -2.735861 -4.972174 2.154561
H  -1.21002 -3.523576 3.451014
H  -0.509849 -1.354621 2.560724
H  -0.583115 2.873789 -0.056305
H  -1.284745 4.712995 1.396229
H  -2.728696 4.276832 3.354079
H  -3.486637 1.9791 3.848621
H  -2.79346 0.113182 2.420222
H  0.585218 -2.873848 0.058143
H  1.282687 -4.712141 -1.397288
H  2.721849 -4.275226 -3.358473
H  3.479488 -1.97739 -3.853272
H  2.790061 -0.112192 -2.422151
H  2.915095 2.05578 0.960002
H  3.619999 4.209923 0.030765
H  2.764737 4.962738 -2.160404
H  1.213062 3.53151 -3.445393
H  0.49884 1.368502 -2.551995
H  0.67596 1.502242 2.426416
H  1.505983 1.172319 4.705474
H  3.032782 -0.70184 5.21833
H  3.746444 -2.246374 3.428847
H  2.922421 -1.951727 1.138944
H  -0.661918 -1.482519 -2.438305
H  -1.506838 -1.1529 -4.711459
H  -3.05944 0.704164 -5.208921
H  -3.78265 2.232681 -3.409509
H  -2.944016 1.938553 -1.125007
totalener: -2067.43986461456052 hartree
nucrepener: 4684.00599887922363 hartree
electener: -6751.44590664561929 hartree
twoeener: 5334.78370470379468 hartree
kineticenergy: 2063.28739036393517 hartree
exchangeener: -75.294730391266 hartree
correlationener: -5.111254820848 hartree
xcener: -80.405985212114 hartree
energy: -2153.8572 -2153.8565 -301.2840 -301.2839 -301.2836 -301.2829 -301.2828 -301.2824 -300.8983 -300.8969 -300.8962 -300.8957 -300.8952 -300.8950 -300.8911 -300.8908 -300.8894 -300.8892 -300.8890 -300.8880 -300.5304 -300.5294 -300.5290 -300.5286 -300.5275 -300.5256 -300.4228 -300.4226 -300.4221 -300.4217 -300.4212 -300.4211 -300.3589 -300.3585 -300.3582 -300.3581 -300.3579 -300.3564 -202.3576 -202.3547 -147.8967 -147.8926 -147.8926 -147.8917 -147.8915 -147.8867 -35.0078 -34.7087 -34.4099 -34.4075 -34.3546 -34.3530 -32.4700 -31.9019 -31.0921 -31.0908 -30.9871 -30.9864 -30.8844 -30.8396 -30.8121 -30.8110 -30.8074 -30.8060 -28.8317 -27.8534 -26.4738 -26.4716 -26.3657 -26.3637 -26.1998 -26.0550 -26.0522 -26.0224 -26.0215 -26.0206 -25.0873 -24.6205 -23.4144 -23.4127 -23.2135 -23.2122 -22.9241 -22.5258 -21.6456 -21.6038 -21.6022 -21.4900 -21.4871 -21.2357 -21.2185 -21.2177 -21.2018 -21.1984 -20.8954 -20.7856 -20.4799 -20.4014 -20.3995 -20.3319 -20.3313 -20.2055 -20.1203 -20.1172 -19.7821 -19.7786 -19.6685 -18.5632 -18.5218 -18.4986 -18.4953 -18.4727 -18.4689 -18.1794 -17.9858 -17.9341 -17.9315 -17.8290 -17.8198 -17.8153 -17.5797 -17.5765 -17.3987 -17.3970 -17.3636 -14.9144 -14.7178 -14.7175 -14.5901 -14.5836 -14.4792 -14.3542 -14.2479 -14.2444 -14.2079 -14.2044 -14.1290 -5.9790 -5.2397 -5.2367 -4.7523 -4.7413 -4.5171 -4.3181 -4.1861 -3.9138 -3.8990 -3.5911 electronvolt
chargesum: 2.0000000
charge: 0.110193 0.531005 0.113569 -0.084984 -0.136944 -0.087486 -0.121377 -0.166978 0.123349 -0.166578 -0.119840 -0.088683 -0.135890 -0.091293 0.535010 0.123209 -0.163350 -0.125378 -0.091112 -0.130082 -0.093512 0.107088 -0.083883 -0.135760 -0.088082 -0.121585 -0.163988 0.102724 -0.160104 -0.119007 -0.088084 -0.134471 -0.081541 -0.158650 -0.115479 -0.089767 -0.131727 -0.089017 0.119900 0.143262 0.141300 0.138141 0.098567 0.094669 0.138961 0.138984 0.141275 0.116508 0.093484 0.139075 0.139017 0.141345 0.117357 0.119242 0.145296 0.141777 0.139008 0.100054 0.097708 0.138166 0.139997 0.143061 0.116327 0.096509 0.140045 0.140361 0.142503 0.116584
charge: -0.194965 0.763190 -0.195769 0.083814 0.108747 0.127527 0.100225 0.063542 -0.195801 0.063636 0.100234 0.127719 0.108882 0.083815 0.763182 -0.195719 0.063603 0.100249 0.127726 0.108802 0.083827 -0.195770 0.083841 0.108908 0.127609 0.100223 0.063503 -0.195076 0.063312 0.100134 0.127503 0.109094 0.084233 0.063125 0.100078 0.127553 0.109211 0.084327 -0.042561 -0.040431 -0.035633 -0.042155 -0.048667 -0.049005 -0.042126 -0.035628 -0.040426 -0.042518 -0.048912 -0.042139 -0.035627 -0.040436 -0.042521 -0.042467 -0.040399 -0.035626 -0.042146 -0.048970 -0.049068 -0.042182 -0.035648 -0.040437 -0.042634 -0.049182 -0.042182 -0.035626 -0.040401 -0.042521
qa: 0.1102 0.5310 0.1136 -0.0850 -0.1369 -0.0875 -0.1214 -0.1670 0.1233 -0.1666 -0.1198 -0.0887 -0.1359 -0.0913 0.5350 0.1232 -0.1634 -0.1254 -0.0911 -0.1301 -0.0935 0.1071 -0.0839 -0.1358 -0.0881 -0.1216 -0.1640 0.1027 -0.1601 -0.1190 -0.0881 -0.1345 -0.0815 -0.1586 -0.1155 -0.0898 -0.1317 -0.0890 0.1199 0.1433 0.1413 0.1381 0.0986 0.0947 0.1390 0.1390 0.1413 0.1165 0.0935 0.1391 0.1390 0.1413 0.1174 0.1192 0.1453 0.1418 0.1390 0.1001 0.0977 0.1382 0.1400 0.1431 0.1163 0.0965 0.1400 0.1404 0.1425 0.1166
va: 3.5700 4.1133 3.5577 3.7039 3.7754 3.8259 3.8318 3.7765 3.5497 3.7838 3.8262 3.8321 3.7830 3.7212 4.1051 3.5443 3.7738 3.8272 3.8329 3.7846 3.7196 3.5697 3.7092 3.7745 3.8284 3.8299 3.7647 3.5791 3.7621 3.8355 3.8290 3.7774 3.7096 3.7785 3.8323 3.8302 3.7732 3.7209 1.0067 0.9696 0.9707 0.9734 1.0026 1.0005 0.9725 0.9721 0.9706 1.0081 1.0072 0.9721 0.9725 0.9708 1.0075 1.0074 0.9682 0.9703 0.9730 1.0038 1.0059 0.9739 0.9715 0.9694 1.0072 1.0092 0.9726 0.9716 0.9694 1.0059
total: -2070.573736167 hartree
dispersion: -0.087087483 hartree
energy: -2070.660823649988 hartree
dipole: -0.004573269 0.004421490 -0.000151779 -0.008215204 0.009287436 0.001072232 -0.001094584 0.001058046 -0.000036538
dipolemethod: SCF
magnitude: 0.001083537 au
magnitude: 0.002754133 debye
