program: Gaussian 09
title: 000004513
version: EM64L-G09RevD.01
frameworkgroup: C1[X(C12H21N5O2S2)]
method: RPBEPBE
basis: SDD
operation: Freq
keyword: #p
keyword: freq=noraman
keyword: PBEPBE/SDD
title: #p freq=noraman PBEPBE/SDD
converged: YES YES NO NO
title: Mulliken charges:
elementType: S S O O N N N N N C C C C C C C C C C C C H H H H H H H H H H H H H H H H H H H H H
charge: 0.131312 0.309781 -0.345205 -0.277425 -0.093335 -0.048859 -0.365836 -0.399266 0.089716 -0.410366 -0.188396 -0.729485 0.528564 -0.820474 -0.320129 -0.725856 -0.640759 -0.610553 0.453500 -0.303678 -0.657942 0.260689 0.240986 0.272801 0.263990 0.239303 0.285777 0.270309 0.272549 0.278119 0.321706 0.222721 0.247415 0.224610 0.218141 0.223934 0.222116 0.357546 0.283983 0.240108 0.244214 0.233672
chargesum: 0.00000
title: Mulliken charges with hydrogens summed into heavy atoms:
elementType: S S O O N N N N N C C C C C C C C C C C C
charge: 0.131312 0.309781 -0.345205 -0.277425 -0.093335 -0.048859 -0.044130 -0.041719 0.089716 0.091309 -0.188396 -0.192693 0.528564 -0.277617 0.204951 -0.447738 0.053988 0.053638 0.453500 -0.019695 0.060053
polarizability: 2.68170172e+02 -5.35927993e+00 1.93642667e+02 1.22036408e+01 1.78647768e+01 1.84260508e+02
1716.lowfreq: -2.3245 0.0017 0.0017 0.0019 5.7583 8.6167 19.0712 25.3216 38.9218
frequency: 18.7251 24.9565 38.9205 46.5897 55.1512 77.7191 85.7112 94.0476 99.8722 109.2865 120.5661 147.2763 157.8193 179.6658 201.3317 220.3377 223.7470 231.0457 232.9298 255.0003 260.9851 281.1509 310.3509 314.3993 324.5665 359.4610 368.7056 395.1017 416.2517 447.8086 496.7206 519.7965 549.5276 564.6048 573.6723 592.4800 611.6715 630.2164 648.1623 660.1450 675.2242 706.2190 712.1817 720.4579 788.4374 793.8239 813.9492 818.9946 838.0235 864.8683 886.2736 936.4772 967.4209 973.2807 989.9747 1030.4563 1037.5590 1038.6157 1088.1436 1093.4825 1112.5899 1115.3469 1132.4196 1136.9627 1142.2306 1160.1867 1168.8492 1174.0307 1214.7070 1219.8818 1232.1813 1242.3813 1263.6659 1270.4067 1273.8546 1294.2098 1311.0982 1344.1097 1349.7738 1366.5442 1411.5675 1424.3737 1428.2505 1435.3047 1440.1716 1445.2390 1453.9109 1461.4262 1464.3236 1474.0627 1476.3547 1478.7219 1482.7795 1496.1409 1499.5966 1513.9256 1525.5589 1571.3775 1628.8978 2893.1979 2900.8632 2909.5089 2947.3868 2965.4086 3005.3152 3016.3427 3017.2721 3028.9604 3032.6652 3032.7641 3038.2726 3080.2881 3084.9960 3103.3443 3106.5944 3116.0605 3144.0721 3232.6568 3244.0752 3441.1033
redmass: 5.6344 5.4019 5.4912 4.0344 4.7313 3.6170 4.0627 5.2704 6.0077 4.3327 5.0400 1.1700 7.4160 3.8791 3.5430 4.0867 4.5702 1.3617 2.5491 1.0747 2.2496 3.4488 4.0550 3.5586 2.8783 2.4008 2.1005 5.6307 5.3570 3.0783 5.4118 2.2913 6.4683 2.1065 4.9690 4.6970 5.2046 3.5944 1.6761 9.7365 5.6210 4.4404 3.7263 2.8953 1.5826 3.1539 2.1481 4.4753 1.1379 2.8247 2.3512 3.6829 2.0859 3.7055 2.0096 2.0456 1.6230 1.6241 2.6485 1.2692 2.7598 1.2833 1.2865 1.9420 1.6535 1.6737 1.7384 1.7925 1.6022 1.5439 2.5460 1.2289 1.8105 1.8121 2.0003 1.2123 2.7258 1.6805 3.3067 1.3190 1.4441 1.1397 1.1075 1.0954 1.1198 1.4944 1.1278 1.0454 1.2612 1.0504 1.0838 1.0875 1.0597 1.0586 1.1032 6.7754 7.6777 4.1566 2.5937 1.0593 1.0598 1.0504 1.0397 1.0583 1.0891 1.0995 1.0891 1.0792 1.0817 1.0728 1.0610 1.1012 1.1008 1.1062 1.0957 1.1053 1.0830 1.0960 1.0913 1.0754
irintensity: 4.4724 0.5333 1.0746 2.1713 1.2293 1.0102 1.8626 0.6118 3.9272 0.8551 6.4503 0.2289 0.9080 3.7518 3.3871 4.7026 2.8509 2.3669 1.2679 0.0185 1.3456 2.3501 5.4927 2.7572 5.0412 3.2400 6.3395 5.8478 4.4034 1.4462 0.1230 52.7452 9.1185 85.8002 16.0503 2.4940 17.4822 5.4150 16.5747 7.1018 24.7987 2.5490 14.8743 73.1259 32.0640 9.2944 6.6086 12.5311 118.0783 3.7854 21.6407 7.7340 2.6850 34.9172 11.9996 17.1903 15.6228 20.7444 12.7210 4.5735 58.0459 2.2948 3.2870 25.3676 8.1362 1.8572 12.5314 2.3010 16.6816 32.5121 65.0754 11.6698 8.5278 117.0274 62.5466 7.0490 0.8473 45.8283 64.7280 31.8857 67.2440 2.5217 11.7836 29.1455 5.2318 91.0235 11.4233 6.9834 11.0494 19.9480 11.7243 24.7527 18.6326 19.7458 16.3246 5.0247 32.6135 381.3417 373.3277 49.6835 57.6252 59.3632 57.8184 37.3304 11.5275 37.4736 5.3462 38.9484 36.2807 24.1594 10.1062 20.8766 51.0718 8.6264 16.1405 2.5825 134.3876 1.6205 2.5102 138.7249
temp: 298.150 k
press: 1.00000 atm
elementType: 16 16 8 8 7 7 7 7 7 6 6 6 6 6 6 6 6 6 6 6 6 1 1 1 1 1 1 1 1 1 1 1 1 1 1 1 1 1 1 1 1 1
symmnumber: 1
zpe: 877454.3 jmol-1
zpe.correction: 0.334205 hartree
zpe.thermalcorrener: 0.357843 hartree
zpe.thermalcorrenthalpy: 0.358787 hartree
zpe.thermalcorrgfe: 0.279272 hartree
zpe.sumelectzpe: -1688.463822 hartree
zpe.sumelectthermal: -1688.440184 hartree
zpe.sumelectthermalent: -1688.439240 hartree
zpe.sumelectthermalfe: -1688.518755 hartree
dipole: 6.6014 2.0527 1.5784
dipole: 7.0911
quadrupole: -153.7472 -144.3390 -133.1239
quadrupole: -16.7926 -9.1538 -6.4559
quadrupole: -10.0105 -0.6023 10.6128 -16.7926 -9.1538 -6.4559
hfenergy: -1688.7980269 hartree
pointgroup: C01 [X(C12H21N5O2S2)]
dipole: 0.6843683 -2.5584992 0.8769582 debye
polarizability: 200.3490044|10.8757032|260.8136222|12.6272192|-26.9013163|184.9107202 unknown
InChI: InChI=1S/C12H21N5O2S2/c1-13-11(6-17(18)19)14-4-5-20-8-10-9-21-12(15-10)7-16(2)3/h6,9,13-14H,4-5,7-8H2,1-3H3
charge 0 multiplicity 1
42 atoms
S  -0.359274 -3.737357 1.087264
S  3.671472 -0.375593 0.390513
O  -1.615923 3.307017 0.621024
O  -1.875969 3.137829 -1.658431
N  2.601645 2.327038 -0.487052
N  1.361532 -1.161853 -0.694371
N  -1.743773 -0.92714 0.807376
N  -1.505997 1.092935 2.002676
N  -1.794278 2.568578 -0.487278
C  1.907781 1.251027 -1.222799
C  2.129582 -0.094559 -0.581018
C  -1.787345 -3.231246 -0.059589
C  1.896007 -2.292518 -0.038466
C  1.159026 -3.59559 -0.088166
C  -1.807644 -1.736944 -0.419937
C  3.11109 -2.069552 0.593081
C  1.900956 2.723792 0.759377
C  2.914525 3.496022 -1.339661
C  -1.699292 0.450024 0.810365
C  -1.854388 1.176644 -0.403939
C  -1.369748 0.420325 3.292261
H  0.807534 1.409174 -1.324082
H  2.319548 1.215726 -2.251016
H  -2.687325 -3.522209 0.510138
H  -1.731929 -3.84636 -0.972619
H  -2.749307 -1.520282 -0.962413
H  -0.949651 -1.49458 -1.078016
H  0.769318 -3.795688 -1.100307
H  1.805424 -4.432715 0.216982
H  3.707784 -2.777909 1.16496
H  -1.315387 -1.420666 1.601107
H  2.546218 3.414078 1.330938
H  0.923255 3.225552 0.570729
H  1.718633 1.832549 1.38555
H  2.004876 4.028458 -1.706628
H  3.519328 4.214619 -0.75898
H  3.510274 3.174924 -2.212663
H  -1.503404 2.13212 1.888303
H  -1.989748 0.678393 -1.358982
H  -2.246741 -0.219069 3.517386
H  -1.294051 1.184716 4.081063
H  -0.457236 -0.208715 3.348023
