program: Gaussian 09
title: 000076352
version: EM64L-G09RevD.01
frameworkgroup: C1[X(C12H21NO6)]
method: RPBEPBE
basis: SDD
operation: Freq
keyword: #p
keyword: freq=noraman
keyword: PBEPBE/SDD
title: #p freq=noraman PBEPBE/SDD
converged: YES YES NO NO
title: Mulliken charges:
elementType: O O O O O O N C C C C C C C C C C C C H H H H H H H H H H H H H H H H H H H H H
charge: -0.264414 -0.264620 -0.264431 -0.245407 -0.245759 -0.245479 -0.119522 -0.401710 -0.401264 -0.402135 -0.262726 -0.263242 -0.262431 0.297252 0.297474 0.297331 -0.751691 -0.751641 -0.751761 0.229499 0.220446 0.229565 0.220344 0.229710 0.220457 0.241970 0.231470 0.241654 0.232248 0.241836 0.231489 0.246996 0.250116 0.248001 0.247006 0.250111 0.248041 0.246992 0.250132 0.248093
chargesum: 0.00000
title: Mulliken charges with hydrogens summed into heavy atoms:
elementType: O O O O O O N C C C C C C C C C C C C
charge: -0.264414 -0.264620 -0.264431 -0.245407 -0.245759 -0.245479 -0.119522 0.048235 0.048646 0.048032 0.210713 0.210660 0.210894 0.297252 0.297474 0.297331 -0.006577 -0.006483 -0.006545
polarizability: 1.77845648e+02 -1.82593279e-02 1.76822536e+02 -3.09562383e-02 1.39547712e-01 1.30372459e+02
1716.lowfreq: -16.3338 -7.6080 -5.5206 -0.0002 0.0007 0.0009 1.6164 5.4937 13.6537
frequency: -16.0345 -5.7184 13.6218 16.7670 19.7732 26.6319 27.9110 29.3387 37.1365 54.0120 57.7297 60.9981 105.1067 106.2334 124.4480 178.6081 184.9292 186.8910 196.5319 241.4716 243.6173 245.8558 304.4347 304.9992 384.3687 407.3662 408.5874 442.5230 508.5169 509.1420 567.5510 568.0789 568.2921 614.3239 614.6457 615.2191 784.6332 788.3441 790.7020 791.4852 836.1568 836.2647 888.8009 942.5448 942.9684 946.5548 1001.1445 1001.3870 1004.1483 1040.5673 1041.1172 1044.6262 1044.8499 1045.0532 1077.5942 1095.3523 1095.7948 1098.8453 1154.8832 1155.8619 1187.3516 1195.9870 1196.3560 1204.6301 1240.1264 1240.8473 1274.3639 1289.5719 1291.2008 1322.2737 1328.8214 1329.6456 1380.3719 1380.4056 1383.6886 1386.3823 1386.6068 1394.7795 1454.2136 1454.4338 1454.8161 1456.1406 1456.3448 1456.6232 1467.7592 1468.5851 1472.3780 1478.1719 1486.1457 1486.7773 1650.2497 1650.2721 1651.7010 2916.9061 2917.2152 2925.4678 3006.3451 3006.4106 3006.5070 3014.0625 3014.4057 3015.3370 3043.8115 3049.0782 3050.4734 3086.0745 3088.1975 3088.6462 3100.1964 3100.2077 3100.3082 3140.0243 3140.0489 3140.0658
redmass: 1.0626 1.5996 7.1293 7.5108 2.2598 4.2436 4.1614 4.5965 1.0533 3.4253 2.9544 3.0280 4.2182 4.2282 3.0881 3.3993 2.8334 2.8026 2.9814 3.9951 3.5094 3.7293 4.1636 4.1172 3.6086 2.9942 2.9850 3.5611 3.4172 3.4269 3.1261 3.1219 3.1232 4.7472 4.7448 4.8175 1.2520 3.9644 1.1978 1.1998 5.2121 5.1050 4.4790 5.7833 5.7305 5.5338 2.0475 2.0437 2.0471 2.2262 2.2101 1.6542 1.6599 1.6598 2.0363 2.9281 2.9053 2.2525 1.4377 1.4479 1.1729 3.4686 3.5077 3.2186 1.6147 1.5989 1.1084 1.2310 1.2230 1.3051 1.4206 1.4111 1.3359 1.3436 1.2354 1.3264 1.3245 1.4657 1.0588 1.0587 1.0585 1.0540 1.0540 1.0539 1.0739 1.0748 1.0808 1.0859 1.0824 1.0830 10.0483 10.0302 9.9706 1.0694 1.0693 1.0697 1.0384 1.0384 1.0383 1.0576 1.0576 1.0576 1.0900 1.0923 1.0922 1.1086 1.1082 1.1081 1.0938 1.0938 1.0939 1.1026 1.1026 1.1026
irintensity: 0.3258 0.6432 1.3740 1.5360 0.6705 1.5237 1.7003 1.7693 0.5421 0.4268 0.1216 0.1320 1.0751 1.1421 2.6381 1.4036 7.4741 7.3977 3.4311 3.5374 8.1409 5.7576 13.8696 13.0773 21.1602 5.4764 5.6839 2.4629 11.1143 11.1492 1.8367 3.1995 3.1919 3.4658 3.4248 7.1106 7.4881 28.3317 6.8024 6.5334 11.3204 11.3630 0.9586 91.3369 88.7184 2.0899 148.4762 144.0675 9.8941 72.9404 74.7359 9.7526 7.1960 6.6400 0.7358 7.0588 7.2145 0.0531 30.2999 27.2919 15.4860 514.4356 526.1616 79.7766 18.4398 17.7019 0.9377 7.5350 7.1144 0.1107 9.7300 9.1446 12.9112 11.0141 1.9958 72.7883 73.3683 0.4213 17.2994 18.8323 18.8768 18.9250 17.8149 17.9014 1.3372 1.3462 4.0025 20.8182 9.3226 9.1482 116.2927 116.0084 352.4954 30.1166 30.2854 126.7971 2.2928 2.1937 2.2050 22.0079 21.0285 19.5216 0.8895 16.6743 16.6579 23.0172 42.3246 42.1751 8.5413 9.7739 9.3662 8.2059 8.3908 10.0249
temp: 298.150 k
press: 1.00000 atm
elementType: 8 8 8 8 8 8 7 6 6 6 6 6 6 6 6 6 6 6 6 1 1 1 1 1 1 1 1 1 1 1 1 1 1 1 1 1 1 1 1 1
symmnumber: 1
zpe: 851341.3 jmol-1
zpe.correction: 0.324259 hartree
zpe.thermalcorrener: 0.346532 hartree
zpe.thermalcorrenthalpy: 0.347476 hartree
zpe.thermalcorrgfe: 0.264643 hartree
zpe.sumelectzpe: -974.445751 hartree
zpe.sumelectthermal: -974.423478 hartree
zpe.sumelectthermalent: -974.422534 hartree
zpe.sumelectthermalfe: -974.505367 hartree
dipole: 0.0057 -0.0414 -4.9669
dipole: 4.9670
quadrupole: -107.2731 -107.2877 -123.3011
quadrupole: -0.0829 0.0929 -0.0801
quadrupole: 5.3475 5.3329 -10.6805 -0.0829 0.0929 -0.0801
hfenergy: -974.7700101 hartree
pointgroup: C01 [X(C12H21N1O6)]
dipole: 0.0105045 0.0144291 -1.954105 debye
polarizability: 177.5485842|-0.4644925|177.119511|0.0468312|-0.1505778|130.3725481 unknown
InChI: InChI=1S/C12H21NO6/c1-10(14)17-7-4-13(5-8-18-11(2)15)6-9-19-12(3)16/h4-9H2,1-3H3
charge 0 multiplicity 1
40 atoms
O  3.408399 -1.549166 -0.340779
O  -0.358198 3.715408 -0.336773
O  -3.031452 -2.158083 -0.349435
O  4.682383 -0.663571 1.398097
O  -1.813725 4.360553 1.365473
O  -2.898779 -3.728616 1.367444
N  0.01353 0.001389 -0.652299
C  1.191589 -0.828277 -0.99116
C  0.144329 1.437993 -0.985198
C  -1.294123 -0.602482 -0.993845
C  2.254077 -0.719498 0.109921
C  -0.487957 2.299941 0.115126
C  -1.732064 -1.582182 0.102333
C  4.58191 -1.43468 0.418041
C  -1.077337 4.666255 0.401366
C  -3.519065 -3.240265 0.396876
C  5.64857 -2.374539 -0.099708
C  -0.806852 6.062289 -0.115494
C  -4.87029 -3.682613 -0.120556
H  0.877874 -1.883931 -1.076972
H  1.643814 -0.546689 -1.969527
H  1.215755 1.694553 -1.065654
H  -0.321573 1.692262 -1.9647
H  -2.051475 0.197329 -1.077125
H  -1.27648 -1.130861 -1.974495
H  1.877536 -1.10976 1.071696
H  2.596162 0.319436 0.266932
H  0.039345 2.176036 1.077202
H  -1.556863 2.068224 0.272588
H  -1.877846 -1.066442 1.067616
H  -1.006966 -2.402463 0.252523
H  6.64417 -1.947016 0.094551
H  5.579177 -3.336633 0.44056
H  5.515249 -2.574566 -1.173664
H  -1.691978 6.695604 0.049624
H  0.0365 6.501778 0.448391
H  -0.53484 6.046093 -1.181713
H  -4.9952 -4.763219 0.048526
H  -5.664487 -3.156265 0.440287
H  -4.986519 -3.441124 -1.187877
