program: Gaussian 16
title: c6h6 opt
version: ES64L-G16RevA.03
frameworkgroup: C1[X(C6H6)]
method: RB3LYP
basis: 6-311G(d,p)
operation: Freq
keyword: #P
keyword: Geom=AllCheck
keyword: Guess=TCheck
keyword: SCRF=Check
keyword: Test
keyword: GenChk
keyword: RB3LYP/6-311G(d,p)
keyword: Freq
converged: NO NO NO NO
title: Mulliken charges:
elementType: H C C H C H C H C H C H
charge: 0.093885 -0.093880 -0.093891 0.093885 -0.093894 0.093882 -0.093867 0.093886 -0.093902 0.093885 -0.093876 0.093885
chargesum: -0.00000
title: Mulliken charges with hydrogens summed into heavy atoms:
elementType: C C C C C C
charge: 0.000006 -0.000005 -0.000012 0.000020 -0.000017 0.000008
chargesum: 0.00000
polarizability: 7.41416296e+01 -2.83626145e-04 7.41406201e+01 2.54811836e-08 -9.57210285e-08 2.82187065e+01
1716.lowfreq: -54.0886 -53.9476 -53.4092 -0.0002 0.0005 0.0007 405.5444 405.6577 624.0711
frequency: 405.5444 405.6577 624.0711 624.1034 672.3051 721.3789 851.6234 851.6582 973.8944 973.9717 1009.7990 1025.5027 1026.8708 1063.9965 1064.0734 1174.5218 1197.9117 1197.9537 1351.5474 1379.3015 1516.9162 1516.9733 1649.4478 1649.4697 3179.1025 3188.7674 3188.8214 3204.6063 3204.6589 3215.3357
redmass: 2.8442 2.8444 6.0263 6.0262 1.0848 3.5366 1.2476 1.2476 1.3813 1.3812 1.2613 6.0173 6.5424 1.6612 1.6610 1.0702 1.1272 1.1272 7.0837 1.2476 2.0739 2.0741 5.6015 5.6019 1.0838 1.0875 1.0875 1.0950 1.0950 1.0996
irintensity: 0.0000 0.0000 0.0000 0.0000 110.5901 0.0000 0.0000 0.0000 0.0000 0.0000 0.0000 0.0000 0.0000 5.5047 5.5035 0.0000 0.0000 0.0000 0.0000 0.0000 8.6601 8.6611 0.0000 0.0000 0.0001 0.0001 0.0002 44.2310 44.2206 0.0000
temp: 298.150 k
press: 1.00000 atm
elementType: 1 6 6 1 6 1 6 1 6 1 6 1
symmnumber: 1
zpe: 263835.1 jmol-1
zpe.correction: 0.100489 hartree
zpe.thermalcorrener: 0.104907 hartree
zpe.thermalcorrenthalpy: 0.105852 hartree
zpe.thermalcorrgfe: 0.073023 hartree
zpe.sumelectzpe: -232.226906 hartree
zpe.sumelectthermal: -232.222488 hartree
zpe.sumelectthermalent: -232.221544 hartree
zpe.sumelectthermalfe: -232.254373 hartree
dipole: 0.0000 -0.0000 -0.0000
dipole: 0.0000
quadrupole: -31.8659 -31.8664 -39.5485
quadrupole: -0.0000 -0.0000 0.0000
quadrupole: 2.5610 2.5606 -5.1216 -0.0000 -0.0000 0.0000
hfenergy: -232.3273954 hartree
pointgroup: C01 [X(C6H6)]
dipole: -0.0000131 0.0000122 0.000001 debye
dipolederiv: 0.023792 0.0086583 -0.0790827 0.0086568 0.1314762 0.014145 -0.0790881 0.0141464 -0.0717354 -0.0252577 -0.0087308 0.081535 -0.0087325 -0.1314666 -0.0143231 0.0815645 -0.014327 0.0732271 -0.0218599 -0.0000147 -0.084018 -0.0000183 -0.1321778 -0.0074362 -0.0839964 -0.0074382 0.0704605 0.0204485 0.0002072 0.081499 0.0002104 0.1321755 0.0074635 0.0814884 0.0074666 -0.0690666 0.1199333 -0.0103631 0.001453 -0.0103492 -0.1319867 -0.0033233 0.0014138 -0.0033248 -0.0714739 -0.1170508 0.01024 -0.0013961 0.010234 0.1319764 0.0034789 -0.001394 0.0034789 0.0685832 -0.0252859 -0.0087292 0.0815392 -0.0087416 -0.1314667 -0.0143504 0.0815573 -0.0143278 0.0732091 0.0237918 0.0086593 -0.0790843 0.0086669 0.1314779 0.0141586 -0.0790788 0.0141462 -0.0717158 -0.0218464 -0.0000156 -0.0840081 -0.0000263 -0.1321759 -0.0074198 -0.0839886 -0.0074399 0.0704983 0.0204514 0.0002069 0.0814923 0.0002102 0.1321731 0.0074583 0.0815003 0.0074662 -0.0690886 0.1199164 -0.0103529 0.0014669 -0.010339 -0.1319849 -0.003331 0.0014232 -0.0033263 -0.0714858 -0.1170327 0.0102346 -0.0013963 0.0102285 0.1319795 0.0034795 -0.0014016 0.0034797 0.0685879 unknown
polarizability: 74.0650716|-1.8612484|28.4252324|-0.0990288|-2.4448693|74.0106522 unknown
InChI: InChI=1/6C.6H
charge 0 multiplicity 1
12 atoms
H  1.21250967 -0.16423564 2.14768701
C  0.68200531 -0.09238971 1.20796039
C  -0.70706207 -0.0352271 1.19652219
H  -1.25712023 -0.06260842 2.12730763
C  -1.38902865 0.05715187 -0.01144287
H  -2.46960501 0.1016313 -0.02035642
C  -0.68199454 0.09233686 -1.20800232
H  -1.2125454 0.16420864 -2.14769428
C  0.70704453 0.03518729 -1.19653577
H  1.25705793 0.06256545 -2.12735618
C  1.38903312 -0.05718405 0.01144109
H  2.46960534 -0.10163648 0.02036952
