program: TURBOMOLE
programVersion: 7.7.1
title: ChemShell job
elementType: c
elementType: n
elementType: o
elementType: h
elementType: co
elementType: s
elementType: f
method: uhf
method: dft
functional: b3-lyp
elementType: c n o h co s f
basis: def2-TZVP def2-TZVP def2-TZVP def2-TZVP def2-TZVP def2-TZVP def2-TZVP
energy: -4869.848429314 hartree
formula: C52H47CoF3N6O6S
InChI: InChI=1/C51H44F3N5O4S.CH3NO2.Co/c1-5-59-43(42-26-24-33-16-12-14-22-40(33)45(42)46-41-23-15-13-17-34(41)25-27-44(46)60)32-58(57-59)31-38-29-39(50(2,3)4)28-37(49(38)61)30-55-47(35-18-8-6-9-19-35)48(36-20-10-7-11-21-36)56-64(62,63)51(52,53)54;1-2(3)4;/h6-30,32,47-48H,5,31H2,1-4H3;1H3;/q-4;;+4/rC51H44CoF3N5O4S.CH3NO2/c1-5-59-43-32-57(56-59)30-37-28-39(50(2,3)4)29-38-31-58-47(35-18-8-6-9-19-35)48(36-20-10-7-11-21-36)60(65(61,62)51(53,54)55)52(58,64-49(37)38)63-44-27-25-34-17-13-15-23-41(34)46(44)45-40-22-14-12-16-33(40)24-26-42(43)45;1-2(3)4/h6-29,31-32,47-48H,5,30H2,1-4H3;1H3
116 atoms
C  1.17648887 -5.40058439 -1.82876879
C  0.23475697 -4.48643749 -2.19180175
C  -0.38588595 -3.66687158 -1.21930786
C  -1.29590885 -2.6349407 -1.7215648
N  -2.6318577 -2.51974771 -1.52392083
C  -3.5148806 -3.39124862 -0.75096591
C  -4.30033851 -2.6201647 0.28926096
N  -3.14354065 -1.50054983 -2.14369876
N  -2.14739576 -0.94268089 -2.75576569
C  -0.98843189 -1.58091682 -2.53890971
C  -0.06933299 -3.77227757 0.11935898
C  -0.77702291 -2.98714966 1.15472887
C  -0.58630193 -1.60334482 1.23510686
O  0.15413698 -0.97377189 0.37909996
C  -1.23880186 -0.9083929 2.30454474
C  -2.01947377 -1.55165483 3.20967364
C  -2.24922075 -2.94541867 3.12751165
C  -1.61460482 -3.66870558 2.08449676
C  -1.88274179 -5.05893343 2.00183278
C  -2.72049469 -5.67780936 2.89192667
C  -3.33894762 -4.95341044 3.92486455
C  -3.09925165 -3.60993259 4.03264054
C  0.96077289 -4.68593547 0.49815095
C  1.57477982 -5.51173637 -0.47865894
C  2.59131271 -6.41212927 -0.08841999
C  2.99632066 -6.48384727 1.21400586
C  2.40517673 -5.65048436 2.18245375
C  1.41367984 -4.77634846 1.83545679
H  1.63861182 -6.03408631 -2.57463571
H  -0.04998 -4.3836465 -3.23073263
H  -4.17129153 -3.89891356 -1.45839984
H  -2.87973967 -4.14042853 -0.28739296
H  -4.82960945 -3.32689862 0.9262589
H  -3.63860359 -2.03381777 0.9235299
H  -5.02819943 -1.95392778 -0.17031298
H  -0.041176 -1.26118686 -2.93579867
H  -1.08643388 0.15785398 2.40869173
H  -2.48161372 -0.98707689 4.01109955
H  -1.41751584 -5.65067936 1.22399886
H  -2.90258067 -6.74083423 2.79882068
H  -3.99400655 -5.45421438 4.62490647
H  -3.56841259 -3.03311566 4.82134045
H  3.05211266 -7.0379562 -0.8427159
H  3.77935657 -7.17247519 1.50263083
H  2.74445269 -5.69760836 3.20847464
H  0.97608889 -4.13075853 2.58363271
C  -2.35269873 0.29984296 -3.5100566
C  -2.71170169 1.43663484 -2.60903571
C  -1.7758508 1.7852978 -1.60757282
O  -0.64844693 1.16169587 -1.57178282
Co 0.42191695 0.8932769 0.03174599
N  2.06996276 1.92475878 0.51971294
S  3.5167946 1.28491186 0.44610395
C  4.31809151 2.01155277 -1.04932088
F  5.47710938 1.40579184 -1.27997586
F  3.5372716 1.83929179 -2.11405976
F  4.53955648 3.30819963 -0.8891649
O  4.3895225 1.67882381 1.53926482
O  3.36913162 -0.11453298 0.08558099
C  1.86742679 3.18559464 1.21734786
C  0.47352795 3.12095665 1.89417778
N  -0.42068895 2.55451371 0.9039879
C  -1.35021885 3.25555163 0.38422496
C  -2.16876976 2.83093168 -0.72593192
C  -3.36967062 3.5122376 -0.93985489
C  -4.26944751 3.18325664 -1.93840378
C  -5.56615737 3.96837555 -2.10468676
C  -6.41573027 3.43538561 -3.25854263
C  -6.39668227 3.87419856 -0.81814891
C  -5.23710341 5.43881438 -2.39406273
C  -3.91010755 2.10704376 -2.75287769
H  2.6120517 3.32581662 2.00849277
H  0.17276598 4.14855053 2.13675276
H  -1.55972782 4.25025752 0.78894791
H  -3.60041159 4.33154751 -0.26593597
H  -6.71505524 2.39712773 -3.10303365
H  -7.32978717 4.02406555 -3.34753162
H  -5.89558933 3.5015566 -4.21596852
H  -5.86687434 4.28457451 0.042402
H  -7.33051417 4.4309875 -0.9202209
H  -6.64654325 2.83789468 -0.58647693
H  -4.66413947 5.89638133 -1.58659882
H  -4.65088847 5.53731337 -3.30858662
H  -6.1518603 6.02271632 -2.51586871
H  -4.58250048 1.7774358 -3.5357686
C  0.38292996 2.29954674 3.16419064
C  1.38051984 1.44608984 3.61885559
C  -0.79704091 2.40043273 3.90021256
C  1.19184686 0.70251792 4.77697546
C  -0.98380389 1.66362481 5.05696143
C  0.013379 0.80315991 5.49595637
H  2.31471274 1.34386785 3.08686565
H  -1.58402282 3.06514465 3.5613576
H  1.97625078 0.03653299 5.11051842
H  -1.90539379 1.7614728 5.61620737
H  -0.12814698 0.21779998 6.39483928
C  1.90547179 4.4074795 0.32239496
C  2.32875973 5.61892336 0.8605129
C  1.46961883 4.3812275 -0.99828289
C  2.31431974 6.78084823 0.10513099
C  1.45118984 5.54360237 -1.7555868
C  1.87136979 6.74636223 -1.20877886
H  2.6873247 5.65109436 1.88346779
H  1.15295287 3.45217161 -1.45256183
H  2.6581377 7.71043513 0.53972594
H  1.11159887 5.50479338 -2.78244269
H  1.86196279 7.64947713 -1.80487779
H  -1.41843384 0.47418295 -4.04336854
H  -3.13289465 0.10936799 -4.24622552
C  3.06764665 -2.46267872 -1.8147328
H  2.13780376 -2.22904075 -1.30421085
H  3.60484359 -3.25525563 -1.30661685
H  3.67541159 -1.56238882 -1.85907779
N  2.78297968 -2.87887167 -3.20427463
O  1.93693478 -2.25508474 -3.80931857
O  3.41915561 -3.78682257 -3.67117758
empdispcorrection: -0.346115100 hartree
energy: -4869.8484293135452
energyOcCorr: -4869.8482033393
s2: 3.75953954
charge: -0.000000
dipole: -84.855031 79.040926 -5.814106 -3.503631 3.154124 -0.349506 -4.268305 3.408384 -0.859921
quadrupole: 15230.980109 -15544.575003 -313.594894 22058.301541 -22337.593329 -279.291788 9526.044300 -9824.170478 -298.126178 -596.385818 590.115458 -6.270360 605.376210 -594.054468 11.321742 -1805.438476 1806.128606 0.690130
