program: TURBOMOLE
programVersion: 7.7.1
title: ChemShell job
elementType: c
elementType: h
elementType: n
elementType: o
method: uhf
method: dft
functional: b3-lyp
elementType: c h n o
basis: def2-TZVP def2-TZVP def2-TZVP def2-TZVP
energy: -245.0179761064 hartree
formula: CH3NO2
InChI: InChI=1/CH3NO2/c1-2(3)4/h1H3
7 atoms
C  -0.48418295 0.009356 -4.61637548
H  -1.38435185 -0.50432294 -4.28978751
H  0.38463795 -0.54485294 -4.27088752
H  -0.46595595 1.03002689 -4.25066852
N  -0.47094995 0.005099 -6.10189531
O  -0.46573695 -1.07797988 -6.63001325
O  -0.47106695 1.06738388 -6.66838125
nucrepener: 126.198860643 hartree
empdispcorrection: -0.005877150 hartree
energy: -245.0179761064008
energyOcCorr: -245.0179862633
s2: -0.00000000
charge: -0.000000
dipole: -28.651752 28.637047 -0.014705 -0.022843 0.030590 0.007747 -358.311150 360.028093 1.716943
quadrupole: 31.251009 -47.159505 -15.908497 71.505847 -91.621711 -20.115864 4108.882721 -4163.540463 -54.657742 -0.147775 0.152208 0.004433 320.096420 -321.475017 -1.378597 -0.465713 0.349194 -0.116519
